{"text_format":"3","workbook":"xlsx","n_sheets":6,"sheets":["Einsatz 1","Einsatz 2","Einsatz 3","DRUCKEN - Alle Einsätze","DRUCKEN - Übertrag Berechnung","Listen"],"not_rendered":{"defined_names":1,"comments":3},"read":"whole","date_system":"1900"}

{"sheet":"Einsatz 1","index":0,"n_rows":46,"n_cols":90,"rows_kept":46,"merged":[[4,3,4,6],[4,11,4,12]]}
["Nachweis über Überstunden, Überstundenvergütung und Zeitzuschläge ",{"$nulls":72},"Datum:",{"$f":"TODAY()","v":"2023-02-01"}]
[]
[null,null,"1. Einsatz",{"$nulls":5},"Rufbereitschaft und Zeitzuschläge",{"$nulls":62},"Monat:",1,"Jahr:",2023]
[null,null,{"$f":"VLOOKUP(BW3,Listen!I8:K26,2)","v":"2023-04-09"}]
[null,null,"Name, Vorname:",{"$nulls":7},"Orga-Einheit:","Dezernat 5.3",{"$nulls":60},"Freizeitausgleich wird gewährt:","ja"]
[null,null,"Übliche Wegezeit (h:mm):",null,null,"Industriestunden:",{"$f":"D6*24","v":{"v":0,"d":"0.00"}}]
[{"$nulls":3},"Ja","Ja","Ja","Ja","Ja"]
["Tag","Datum","gesetzl. Feiertag in NRW*","Urlaub**","Krankheit (AU)**","Rufbereitschaft Mo-Fr 15:15 bis 07:00 des Folgetags***","Rufbereitschaft Sa, So, Feiertag (07:00 bis 07:00 des Folgetags)***","Rufbereitschaft       weniger als 12 Std.              (hh:mm)","Uhrzeit Einsatz von (hh:mm)","Uhrzeit Einsatz bis (hh:mm)","Arbeitszeit des Einsatzes (ohne Wegezeit)","Der Einsatz erfolgte ohne Präsenz (z.B. telefonisch)****","Grund des Einsatzes","AZ (ggf. mit WZ)","AZ (ggf. ,mit WZ) gerundet","Beginn Nacht-arbeits-zeit-rahmen","Ende Nacht-arbeits-zeit-rahmen","Nacht-einsatz? \n1-Ja ","Wegezeit 1-ja","Beginn Nacht-einsatz (ohne WZ)","Ende Nacht-einsatz (ohne WZ)","Beginn Nacht-einsatz (mit WZ)","Ende Nachtarbeit (mit WZ)","Nachtarbeit mit WZ","Nachtarbeit ohne WZ","Ende Nacht-einsatz (mit WZ) vor 0","Ende Nacht-einsatz (mit WZ) nach 0","Ende Nacht-einsatz (o WZ) vor 0","Ende Nacht-einsatz (o WZ) nach 0","Summe Nacht-einsatz (mit WZ)","Summe Nacht-einsatz (o WZ)","Samstagsarbeit 13-21 Uhr (mit WZ)","Samstagsarbeit 13-21 Uhr (o WZ)","Samstagsarbeit, wenn negative Zeiten","Beginn Samstags-arbeit o WZ","Beginn Samstags-arbeit m WZ","Ende Samstags-arbeit o WZ","Ende Samstags-arbeit m WZ","Samstagsarbeit 20-21 m WZ","Samstagsarbeit 20-21 o WZ","Beginn Sonntagsarbeit mit WZ","Ende Sonntagsarbeit mit WZ","Beginn Sonntagsarbeit o WZ","Ende Sonntagsarbeit o WZ","Sonntagsarbeit mit WZ","Sonntagsarbeit o WZ","Sonntagsarbeit mit WZ (dezimal)","Sonntagsarbeit o WZ (dezimal)","Beginn Rahmen 24. & 31.12.","Ende Rahmen 24. & 31.12.","Arbeit 24. & 31.12.","Arbeit 24. & 31.12. Ende nach 0 Uhr","Arbeit am 24. & 31.12. (24 h)","Arbeit am 24. & 31.12. (14 h)","Beginn 24.12. & 31.12. (mit WZ)","Ende 24.12. & 31.12. (mit WZ)","Beginn 24.12. & 31.12. (o WZ)","Ende 24.12. & 31.12. (o WZ)","Arbeit 24.12. & 31.12. (mit WZ)","Arbeit 24.12. & 31.12. (o WZ)","Beginn 24.12. & 31.12. (mit WZ)","Ende 24.12. & 31.12. bis 14 Uhr (mit WZ)","Beginn 24.12. & 31.12. (o WZ)","Ende 24.12. & 31.12. bis 14 Uhr (o WZ)","Ende 24. & 31.12. vor 14 Uhr BB32, BC32 dezimal)","Ende 24. & 31.12. nach 14 Uhr","Stunden mit Freizeitausgleich","Stunden ohne Freizeitausgleich","Arbeit am Samstag           13-20 Uhr","Arbeit am Samstag          20-21 Uhr","Arbeit am 24.12.& 31.12. \n 6-14 Uhr","Arbeit am 24.12. 14-24 Uhr; am 25./26.12.           & am 01.05. ","Arbeit am Sonntag","Arbeit am Feiertag mit Freizeitausgleich","Arbeit am Feiertag ohne Freizeitausgleich","Nachtarbeit                 (21-6 Uhr)"]
[{"$nulls":3},5167,5168,5200,5201,5204,{"$nulls":58},5012,"5012 und 5014",5080,5083,5070,5071,5050,5061,"5060 und 5061",5040,null,null,"Wochenend. Feiertage",null,"Mo-Fr",null,"Urlaub",null,"Krank",{"$f":"DATE(BW3,1,1)","v":44927},{"$f":"IF(INT(BW3/4)=BW3/4,1,0)","v":0}]
[{"$f":"TEXT(B10,\"TTTT\")","v":"Sonntag"},{"$f":"DATE(BW3,BU3,1)","v":"2023-01-01"},{"$f":"IF(BU3=1,\"Neujahr\",IF(BU3=11,\"Allerheiligen\",IF(CJ10=1,CI10,\"\")))","v":"Neujahr"},{"$nulls":7},{"$f":"IF(OR(I10=\"\",J10=\"\"),0,MOD(J10-I10,1))","v":"00:00:00"},null,null,{"$f":"IF(K10=\"\",0,IF(L10=\"\",K10+(2*$D$6),K10))","v":"00:00:00"},{"$f":"IF(J10=\"\",0,(IF(L10=\"ja\",ROUNDUP(N10*48,0.5)/48,ROUNDUP(N10*24,0)/24)))","v":"00:00:00"},"21:00:00","06:00:00",{"$f":"IF(I10=\"\",0,IF(OR(I10>=P10,I10<=Q10),1,IF(OR(J10>=P10,J10<=Q10),1,IF(AND(I10<=P10,J10>=Q10,J10<I10),1,0))))","v":0},{"$f":"IF(L10=\"\",1,\"\")","v":1},{"$f":"IF(OR(I10=\"\",S10=1),0,IF(R10,IF(AND(I10<=P10,I10>=Q10),P10,IF(OR(I10>=P10,I10<=Q10),I10,P10)),0))","v":"00:00:00"},{"$f":"IF(OR(R10=0,J10=\"\",S10=1),0,IF(J10<=Q10,J10,IF(J10>=P10,J10,Q10)))","v":"00:00:00"},{"$f":"IF(OR(I10=\"\",S10=\"\"),0,IF(R10,IF(AND((I10-$D$6)<=P10,(I10-$D$6)>=Q10),P10,IF(OR((I10-$D$6)>=P10,(I10-$D$6)<=Q10),I10-$D$6,P10)),0))","v":"00:00:00"},{"$f":"IF(OR(J10=\"\",S10=\"\"),0,IF(R10,IF(AND((J10+$D$6)<=P10,(J10+$D$6)>=Q10),Q10,IF(OR((J10+$D$6)<=P10,(J10+$D$6)>=Q10),J10+$D$6,Q10)),0))","v":"00:00:00"},{"$f":"IF(AND(S10=\"\",T10=0),0,IF(W10-V10,(W10+1)-V10,0))","v":"00:00:00"},{"$f":"IF(OR(S10=\"1\",T10=0),0,IF(U10-T10,(U10+1)-T10,0))","v":"00:00:00"},{"$f":"IF(W10=0,0,IF(W10<=23.58,X10*24-24))","v":{"v":0,"d":"0.00"}},{"$f":"IF(W10=0,0,IF(W10>0,X10*24))","v":{"v":0,"d":"0.00"}},{"$f":"IF(U10=0,0,IF(U10<=23.58,Y10*24-24))","v":{"v":0,"d":"0.00"}},{"$f":"IF(U10=0,0,IF(U10>0,Y10*24))","v":{"v":0,"d":"0.00"}},{"$f":"IF(AND(S10=1,Z10<=0,AA10<24),AA10,IF(AA10>0,Z10))","v":{"v":0,"d":"0.00"}},{"$f":"IF(AND(S10=\"\",AB10<=0,AC10<24),AC10,IF(AC10>0,AB10))","v":false},{"$f":"IF(AND(F10=0,J10=0),0,IF(AND(A10=\"Samstag\",S10=1),IF(J10>I10,IF(J10>=0.875,0.875,J10+$D$6)-IF(I10<=(13/24),(13/24),I10-$D$6),IF(I10<=0.875,0.875-I10,0)),0))","v":"00:00:00"},{"$f":"IF(S10=1,0,IF(AND(J10=0,F10=0),0,IF(A10=\"Samstag\",IF(J10>I10,IF(J10>=0.875,0.875,J10)-IF(I10<=(13/24),(13/24),I10),IF(I10<=0.875,0.875-I10,0)),0)))","v":"00:00:00"},{"$f":"IF(AG10>0,AG10*24,AF10*24)","v":{"v":0,"d":"0.00"}},{"$f":"IF(AND(A10=\"Samstag\",I10>0,S10=1),0,IF(AND(A10=\"Samstag\",I10>0,S10=\"\"),I10*24,0))","v":{"v":0,"d":"0.00"}},{"$f":"IF(AND(A10=\"Samstag\",I10>0,S10=1),(I10-$D$6)*24,IF(AND(A10=\"Samstag\",I10>0),I10*24,0))","v":{"v":0,"d":"0.00"}},{"$f":"IF(AND(A10=\"Samstag\",J10>0,S10=1),0,IF(AND(A10=\"Samstag\",J10>0,S10=\"\"),J10*24,0))","v":{"v":0,"d":"0.00"}},{"$f":"IF(AND(A10=\"Samstag\",J10>0,S10=1),(J10+$D$6)*24,0)","v":{"v":0,"d":"0.00"}},{"$f":"IF(OR(I10=\"\",L10=\"ja\",AJ10>=21,AND(AJ10<=20,AL10<=20)),0,IF(AND(AJ10<=20,AL10>20,AL10<=21),AL10-20-BV10-BW10,IF(AND(AJ10<=20,AL10>21),21-20-BV10-BW10,IF(AND(AJ10>=20,AJ10<21,AL10>=0,AL10<=12),21-AJ10-BV10-BW10,IF(AND(AJ10<21,OR(AND(AL10>=0,AL10<=21),AND(AL10>=21,AL10<=23.99))),21-20-BV10-BW10)))))","v":{"v":0,"d":"0.00"}},{"$f":"IF(OR(I10=\"\",L10=\"\",AI10>=21,AND(AI10<=20,AK10<=20)),0,IF(AND(AI10<=20,AK10>20,AK10<=21),AK10-20-BV10-BW10,IF(AND(AI10<=20,AK10>21),21-20-BV10-BW10,IF(AND(AI10>=20,AI10<21,AK10>=0,AK10<=12),21-AI10-BV10-BW10,IF(AND(AI10<21,OR(AND(AK10>=0,AK10<=21),AND(AK10>=21,AK10<=23.99))),21-20-BV10-BW10)))))","v":{"v":0,"d":"0.00"}},{"$f":"IF(A10=\"Sonntag\",I10-$D$6,IF(A10=\"Samstag\",IF(J10<I10,0,0),0))","v":"00:00:00"},{"$f":"IF(J10=\"\",0,IF(A10=\"Sonntag\",IF((J10+$D$6)<I10,1,J10+$D$6),IF(A10=\"Samstag\",IF((J10+$D$6)<I10,J10+$D$6,0),0)))","v":"00:00:00"},{"$f":"IF(A10=\"Sonntag\",I10,IF(A10=\"Samstag\",IF(J10<I10,0,0),0))","v":"00:00:00"},{"$f":"IF(A10=\"Sonntag\",IF(J10<I10,1,J10),IF(A10=\"Samstag\",IF(J10<I10,J10,0),0))","v":"00:00:00"},{"$f":"IF(J10=\"\",0,IF(AND(AO10=0,AP10=0),0,IF(OR(A10=\"Sonntag\",A10=\"Samstag\"),AP10-AO10,0)))","v":"00:00:00"},{"$f":"IF(AND(AQ10=0,AR10=0),0,IF(OR(A10=\"Sonntag\",A10=\"Samstag\"),AR10-AQ10,0))","v":"00:00:00"},{"$f":"IF(OR(AS10=0,AS10=\"\"),0,IF(AND(AS10>0,BV10>=0,$BV$5=\"ja\"),AS10*24-BV10,IF(AND(AS10>0,BV10>=0,$BV$5=\"nein\"),AS10*24-BW10)))","v":{"v":0,"d":"0.00"}},{"$f":"IF(OR(AT10=0,AT10=\"\"),0,IF(AND(AT10>0,BV10>=0,$BV$5=\"ja\"),AT10*24-BV10,IF(AND(AT10>0,BV10>=0,$BV$5=\"nein\"),AT10*24-BW10)))","v":{"v":0,"d":"0.00"}},"06:00:00","00:00:00",{"$f":"IF(I10=\"\",0,IF(OR(I10>=AW10,I10<=AX10),1,IF(OR(J10>=AW10,J10<=AX10),1,IF(AND(I10<=TT10,J10>=AX10,J10<I10),1,0))))","v":0},{"$f":"(J10+$D$6)*24","v":{"v":0,"d":"0.00"}},{"v":24,"d":"24.00"},{"v":0,"d":"0.00"},{"$f":"I10*24","v":{"v":0,"d":"0.00"}},{"$f":"IF(OR(J10=\"\",AY10=0),0,IF(AY10=1,IF(AZ10>BA10,AX10,J10+$D$6)))","v":"00:00:00"},{"$f":"IF(I10=\"\",0,IF(AY10,IF(AND(I10<=AW10,I10>=AX10),AX10,IF(OR(I10>=AW10,I10<=AX10),I10,AW10)),0))","v":"00:00:00"},{"$f":"IF(OR(AY10=0,J10=0),0,IF(J10<=AX10,J10,IF(J10>=AW10,J10,AX10)))","v":"00:00:00"},null,{"$f":"IF(BE10=0,0,IF(BE10<=0.25,BF10-BE10,(BF10+1)-BE10))","v":"00:00:00"},{"$f":"IF(I10=\"\",0,IF(AY10,IF(AND((BC10-$G$6)<=BB10,),BB10,IF(OR((BC10-$G$6)>=BB10),BC10-$G$6,BB10)),0))","v":{"v":0,"d":"0.00"}},{"$f":"BD10*24","v":{"v":0,"d":"0.00"}},{"$f":"I10*24","v":{"v":0,"d":"0.00"}},{"$f":"BF10*24","v":{"v":0,"d":"0.00"}},{"$f":"BJ10-BI10","v":{"v":0,"d":"0.00"}},{"$f":"BL10-BK10","v":{"v":0,"d":"0.00"}},{"$f":"IF(O10=\"\",0,IF($BV$5=\"ja\",O10*24,0))","v":{"v":0,"d":"0.00"}},{"$f":"IF(O10=\"\",0,IF($BV$5=\"nein\",O10*24,0))","v":{"v":0,"d":"0.00"}},{"$f":"IF(C10=\"\",IF(AH10=0,0,IF(AH10>=0,AH10-BR10,IF(AND(AH10>=0,BV10>=0,$BV$5=\"ja\"),AH10-BV10,IF(AND(AH10>=0,BW10>=0,$BV$5=\"nein\"),AH10-BW10)))),0)","v":{"v":0,"d":"0.00"}},{"$f":"IF(L10=\"\",AM10,AN10)","v":{"v":0,"d":"0.00"}},null,{"$f":"IF(AND(BU3=5,K10>0),IF(S10=1,BM10,BN10),0)","v":{"v":0,"d":"0.00"}},{"$f":"IF(S10=1, AU10,AV10)","v":{"v":0,"d":"0.00"}},{"$f":"IF($BV$5=\"ja\",IF(OR(K10=\"\",C10=\"\",C10=\"1.Mai\"),0,IF(AND(S10=1,K10>0),(K10+$D$6+$D$6)*24,K10*24)),0)","v":{"v":0,"d":"0.00"}},{"$f":"IF($BV$5=\"nein\",IF(OR(K10=\"\",C10=\"\"),0,IF(AND(S10=1,K10>0),(K10+$D$6+$D$6)*24,K10*24)),0)","v":{"v":0,"d":"0.00"}},{"$f":"IF(S10=1,AD10,AE10)","v":{"v":0,"d":"0.00"}},null,null,{"$f":"IF(OR(D10=\"ja\",E10=\"ja\"),\"\",IF(OR(CJ10=1,TEXT(B10,\"TTTT\")=\"Samstag\",TEXT(B10,\"TTTT\")=\"Sonntag\"),\"ja\",\"\"))","v":"ja"},null,{"$f":"IF(OR(D10=\"ja\",E10=\"ja\"),\"\",IF(CA10=\"ja\",\"\",\"ja\"))","v":""},null,{"$f":"IF(AND(E10=\"\",F10=\"\",G10=\"\"),\"ja\",\"\")","v":"ja"},null,{"$f":"IF(AND(D10=\"\",F10=\"\",G10=\"\"),\"ja\",\"\")","v":"ja"},{"$f":"B10-CH$9","v":0},{"$f":"IF(OR(CH10=CK$10,CH10=CK$12,CH10=CK$13,CH10=CK$15,CH10=CK$16),VLOOKUP(CH10,$CK$10:$CL$16,2),\"\")","v":""},{"$f":"IF($BU$3=5,1,IF(OR(CH10=CK$10,,CH10=CK$12,CH10=CK$13,CH10=CK$14,CH10=CK$15,CH10=CK$16,,CH10=CK$18,CH10=CK$19),1,0))","v":1},{"$f":"VLOOKUP($BW$3,Listen!$I$8:$R$26,4)","v":95},"Karfreitag"]
[{"$f":"TEXT(B11,\"TTTT\")","v":"Montag"},{"$f":"B10+1","v":"2023-01-02"},{"$f":"IF(CJ11=1,CI11,\"\")","v":""},{"$nulls":7},{"$f":"IF(OR(I11=\"\",J11=\"\"),0,MOD(J11-I11,1))","v":"00:00:00"},null,null,{"$f":"IF(K11=\"\",0,IF(L11=\"\",K11+(2*$D$6),K11))","v":"00:00:00"},{"$f":"IF(J11=\"\",0,(IF(L11=\"ja\",ROUNDUP(N11*48,0.5)/48,ROUNDUP(N11*24,0)/24)))","v":"00:00:00"},"21:00:00","06:00:00",{"$f":"IF(I11=\"\",\"\",IF(OR(I11>=P11,I11<=Q11),1,IF(OR(J11>=P11,J11<=Q11),1,IF(AND(I11<=P11,J11>=Q11,J11<I11),1,0))))","v":""},{"$f":"IF(L11=\"\",1,\"\")","v":1},{"$f":"IF(OR(I11=\"\",S11=1),0,IF(R11,IF(AND(I11<=P11,I11>=Q11),P11,IF(OR(I11>=P11,I11<=Q11),I11,P11)),0))","v":"00:00:00"},{"$f":"IF(OR(R11=0,J11=\"\",S11=1),0,IF(J11<=Q11,J11,IF(J11>=P11,J11,Q11)))","v":"00:00:00"},{"$f":"IF(OR(I11=\"\",S11=\"\"),0,IF(R11,IF(AND((I11-$D$6)<=P11,(I11-$D$6)>=Q11),P11,IF(OR((I11-$D$6)>=P11,(I11-$D$6)<=Q11),I11-$D$6,P11)),0))","v":"00:00:00"},{"$f":"IF(OR(J11=\"\",S11=\"\"),0,IF(R11,IF(AND((J11+$D$6)<=P11,(J11+$D$6)>=Q11),Q11,IF(OR((J11+$D$6)<=P11,(J11+$D$6)>=Q11),J11+$D$6,Q11)),0))","v":"00:00:00"},{"$f":"IF(AND(S11=\"\",T11=0),0,IF(W11-V11,(W11+1)-V11,0))","v":"00:00:00"},{"$f":"IF(OR(S11=\"1\",T11=0),0,IF(U11-T11,(U11+1)-T11,0))","v":"00:00:00"},{"$f":"IF(W11=0,0,IF(W11<=23.58,X11*24-24))","v":{"v":0,"d":"0.00"}},{"$f":"IF(W11=0,0,IF(W11>0,X11*24))","v":{"v":0,"d":"0.00"}},{"$f":"IF(U11=0,0,IF(U11<=23.58,Y11*24-24))","v":{"v":0,"d":"0.00"}},{"$f":"IF(U11=0,0,IF(U11>0,Y11*24))","v":{"v":0,"d":"0.00"}},{"$f":"IF(AND(S11=1,Z11<=0,AA11<24),AA11,IF(AA11>0,Z11))","v":{"v":0,"d":"0.00"}},{"$f":"IF(AND(S11=\"\",AB11<=0,AC11<24),AC11,IF(AC11>0,AB11))","v":false},{"$f":"IF(AND(F11=0,J11=0),0,IF(AND(A11=\"Samstag\",S11=1),IF(J11>I11,IF(J11>=0.875,0.875,J11+$D$6)-IF(I11<=(13/24),(13/24),I11-$D$6),IF(I11<=0.875,0.875-I11,0)),0))","v":"00:00:00"},{"$f":"IF(S11=1,0,IF(AND(J11=0,F11=0),0,IF(A11=\"Samstag\",IF(J11>I11,IF(J11>=0.875,0.875,J11)-IF(I11<=(13/24),(13/24),I11),IF(I11<=0.875,0.875-I11,0)),0)))","v":"00:00:00"},{"$f":"IF(AG11>0,AG11*24,AF11*24)","v":{"v":0,"d":"0.00"}},{"$f":"IF(AND(A11=\"Samstag\",I11>0,S11=1),0,IF(AND(A11=\"Samstag\",I11>0,S11=\"\"),I11*24,0))","v":{"v":0,"d":"0.00"}},{"v":0,"d":"0.00"},{"$f":"IF(AND(A11=\"Samstag\",J11>0,S11=1),0,IF(AND(A11=\"Samstag\",J11>0,S11=\"\"),J11*24,0))","v":{"v":0,"d":"0.00"}},{"v":0,"d":"0.00"},{"$f":"IF(OR(I11=\"\",L11=\"ja\",AJ11>=21,AND(AJ11<=20,AL11<=20)),0,IF(AND(AJ11<=20,AL11>20,AL11<=21),AL11-20-BV11-BW11,IF(AND(AJ11<=20,AL11>21),21-20-BV11-BW11,IF(AND(AJ11>=20,AJ11<21,AL11>=0,AL11<=12),21-AJ11-BV11-BW11,IF(AND(AJ11<21,OR(AND(AL11>=0,AL11<=21),AND(AL11>=21,AL11<=23.99))),21-20-BV11-BW11)))))","v":{"v":0,"d":"0.00"}},{"$f":"IF(OR(I11=\"\",L11=\"\",AI11>=21,AND(AI11<=20,AK11<=20)),0,IF(AND(AI11<=20,AK11>20,AK11<=21),AK11-20-BV11-BW11,IF(AND(AI11<=20,AK11>21),21-20-BV11-BW11,IF(AND(AI11>=20,AI11<21,AK11>=0,AK11<=12),21-AI11-BV11-BW11,IF(AND(AI11<21,OR(AND(AK11>=0,AK11<=21),AND(AK11>=21,AK11<=23.99))),21-20-BV11-BW11)))))","v":{"v":0,"d":"0.00"}},"00:00:00","00:00:00","00:00:00","00:00:00","00:00:00","00:00:00",{"v":0,"d":"0.00"},{"v":0,"d":"0.00"},"06:00:00","00:00:00",{"$nulls":16},{"v":0,"d":"0.00"},{"v":0,"d":"0.00"},{"v":0,"d":"0.00"},{"$f":"IF(L11=\"\",AM11,AN11)","v":{"v":0,"d":"0.00"}},null,null,{"v":0,"d":"0.00"},{"$f":"IF($BV$5=\"ja\",IF(OR(K11=\"\",C11=\"\"),0,IF(AND(S11=1,K11>0),(K11+$D$6+$D$6)*24,K11*24)),0)","v":{"v":0,"d":"0.00"}},{"$f":"IF($BV$5=\"nein\",IF(OR(K11=\"\",C11=\"\"),0,IF(AND(S11=1,K11>0),(K11+$D$6+$D$6)*24,K11*24)),0)","v":{"v":0,"d":"0.00"}},{"v":0,"d":"0.00"},null,null,{"$f":"IF(OR(D11=\"ja\",E11=\"ja\"),\"\",IF(OR(CJ11=1,TEXT(B11,\"TTTT\")=\"Samstag\",TEXT(B11,\"TTTT\")=\"Sonntag\"),\"ja\",\"\"))","v":""},null,{"$f":"IF(OR(D11=\"ja\",E11=\"ja\"),\"\",IF(CA11=\"ja\",\"\",\"ja\"))","v":"ja"},null,{"$f":"IF(AND(E11=\"\",F11=\"\",G11=\"\"),\"ja\",\"\")","v":"ja"},null,{"$f":"IF(AND(D11=\"\",F11=\"\",G11=\"\"),\"ja\",\"\")","v":"ja"},{"$f":"B11-CH$9","v":1},{"$f":"IF(OR(CH11=CK$10,CH11=CK$12,CH11=CK$13,CH11=CK$15,CH11=CK$16),VLOOKUP(CH11,$CK$10:$CL$16,2),\"\")","v":""},{"$f":"IF(OR(CH11=CK$10,,CH11=CK$12,CH11=CK$13,CH11=CK$14,CH11=CK$15,CH11=CK$16,,CH11=CK$18,CH11=CK$19),1,0)","v":0},null,"Ostersonntag"]
["Dienstag",{"$f":"B11+1","v":"2023-01-03"},{"$f":"IF(BU3=10,\"Tag d. dt. Einheit\",IF(CJ12=1,CI12,\"\"))","v":""},{"$nulls":7},"00:00:00",null,null,"00:00:00","00:00:00","21:00:00","06:00:00","",1,"00:00:00","00:00:00","00:00:00","00:00:00","00:00:00","00:00:00",{"v":0,"d":"0.00"},{"v":0,"d":"0.00"},{"v":0,"d":"0.00"},{"v":0,"d":"0.00"},{"v":0,"d":"0.00"},false,"00:00:00","00:00:00",{"v":0,"d":"0.00"},{"v":0,"d":"0.00"},{"v":0,"d":"0.00"},{"v":0,"d":"0.00"},{"v":0,"d":"0.00"},{"v":0,"d":"0.00"},{"v":0,"d":"0.00"},"00:00:00","00:00:00","00:00:00","00:00:00","00:00:00","00:00:00",{"v":0,"d":"0.00"},{"v":0,"d":"0.00"},"06:00:00","00:00:00",{"$nulls":16},{"v":0,"d":"0.00"},{"v":0,"d":"0.00"},{"v":0,"d":"0.00"},{"v":0,"d":"0.00"},null,null,{"v":0,"d":"0.00"},{"v":0,"d":"0.00"},{"v":0,"d":"0.00"},{"v":0,"d":"0.00"},null,null,{"$f":"IF(OR(D12=\"ja\",E12=\"ja\"),\"\",IF(OR(CJ12=1,TEXT(B12,\"TTTT\")=\"Samstag\",TEXT(B12,\"TTTT\")=\"Sonntag\"),\"ja\",\"\"))","v":""},null,"ja",null,"ja",null,"ja",{"$f":"B12-CH$9","v":2},"",{"$f":"IF(OR(CH12=CK$10,,CH12=CK$12,CH12=CK$13,CH12=CK$14,CH12=CK$15,CH12=CK$16,,CH12=CK$18,CH12=CK$19),1,0)","v":0},{"$f":"VLOOKUP($BW$3,Listen!$I$8:$R$26,6)","v":98},"Ostermontag"]
["Mittwoch","2023-01-04",{"$f":"IF(CJ13=1,CI13,\"\")","v":""},{"$nulls":7},"00:00:00",null,null,"00:00:00","00:00:00","21:00:00","06:00:00","",1,"00:00:00","00:00:00","00:00:00","00:00:00","00:00:00","00:00:00",{"v":0,"d":"0.00"},{"v":0,"d":"0.00"},{"v":0,"d":"0.00"},{"v":0,"d":"0.00"},{"v":0,"d":"0.00"},false,"00:00:00","00:00:00",{"v":0,"d":"0.00"},{"v":0,"d":"0.00"},{"v":0,"d":"0.00"},{"v":0,"d":"0.00"},{"v":0,"d":"0.00"},{"v":0,"d":"0.00"},{"v":0,"d":"0.00"},"00:00:00","00:00:00","00:00:00","00:00:00","00:00:00","00:00:00",{"v":0,"d":"0.00"},{"v":0,"d":"0.00"},"06:00:00","00:00:00",{"$nulls":16},{"v":0,"d":"0.00"},{"v":0,"d":"0.00"},{"v":0,"d":"0.00"},{"v":0,"d":"0.00"},null,null,{"v":0,"d":"0.00"},{"v":0,"d":"0.00"},{"v":0,"d":"0.00"},{"v":0,"d":"0.00"},null,null,"",null,"ja",null,"ja",null,"ja",3,"",0,{"$f":"VLOOKUP($BW$3,Listen!$I$8:$R$26,7)","v":136},"Chr. Himmelfehrt"]
["Donnerstag","2023-01-05",{"$f":"IF(CJ14=1,CI14,\"\")","v":""},{"$nulls":7},"00:00:00",null,null,"00:00:00","00:00:00","21:00:00","06:00:00","",1,"00:00:00","00:00:00","00:00:00","00:00:00","00:00:00","00:00:00",{"v":0,"d":"0.00"},{"v":0,"d":"0.00"},{"v":0,"d":"0.00"},{"v":0,"d":"0.00"},{"v":0,"d":"0.00"},false,"00:00:00","00:00:00",{"v":0,"d":"0.00"},{"v":0,"d":"0.00"},{"v":0,"d":"0.00"},{"v":0,"d":"0.00"},{"v":0,"d":"0.00"},{"v":0,"d":"0.00"},{"v":0,"d":"0.00"},"00:00:00","00:00:00","00:00:00","00:00:00","00:00:00","00:00:00",{"v":0,"d":"0.00"},{"v":0,"d":"0.00"},"06:00:00","00:00:00",{"$nulls":16},{"v":0,"d":"0.00"},{"v":0,"d":"0.00"},{"v":0,"d":"0.00"},{"v":0,"d":"0.00"},null,null,{"v":0,"d":"0.00"},{"v":0,"d":"0.00"},{"v":0,"d":"0.00"},{"v":0,"d":"0.00"},null,null,"",null,"ja",null,"ja",null,"ja",4,"",{"$f":"IF(OR(CH14=CK$10,,CH14=CK$12,CH14=CK$13,CH14=CK$14,CH14=CK$15,CH14=CK$16,,CH14=CK$18,CH14=CK$19),1,0)","v":0},null,"Pfingstsonntag"]
["Freitag","2023-01-06","",{"$nulls":7},"00:00:00",null,null,"00:00:00","00:00:00","21:00:00","06:00:00","",1,"00:00:00","00:00:00","00:00:00","00:00:00","00:00:00","00:00:00",{"v":0,"d":"0.00"},{"v":0,"d":"0.00"},{"v":0,"d":"0.00"},{"v":0,"d":"0.00"},{"v":0,"d":"0.00"},false,"00:00:00","00:00:00",{"v":0,"d":"0.00"},{"v":0,"d":"0.00"},{"v":0,"d":"0.00"},{"v":0,"d":"0.00"},{"v":0,"d":"0.00"},{"v":0,"d":"0.00"},{"v":0,"d":"0.00"},"00:00:00","00:00:00","00:00:00","00:00:00","00:00:00","00:00:00",{"v":0,"d":"0.00"},{"v":0,"d":"0.00"},"06:00:00","00:00:00",{"$nulls":16},{"v":0,"d":"0.00"},{"v":0,"d":"0.00"},{"v":0,"d":"0.00"},{"v":0,"d":"0.00"},null,null,{"v":0,"d":"0.00"},{"v":0,"d":"0.00"},{"v":0,"d":"0.00"},{"v":0,"d":"0.00"},null,null,"",null,"ja",null,"ja",null,"ja",5,"",0,{"$f":"VLOOKUP($BW$3,Listen!$I$8:$R$26,9)","v":147},"Pfingstmontag"]
["Samstag","2023-01-07","",{"$nulls":7},"00:00:00",null,null,"00:00:00","00:00:00","21:00:00","06:00:00","",1,"00:00:00","00:00:00","00:00:00","00:00:00","00:00:00","00:00:00",{"v":0,"d":"0.00"},{"v":0,"d":"0.00"},{"v":0,"d":"0.00"},{"v":0,"d":"0.00"},{"v":0,"d":"0.00"},false,"00:00:00","00:00:00",{"v":0,"d":"0.00"},{"v":0,"d":"0.00"},{"v":0,"d":"0.00"},{"v":0,"d":"0.00"},{"v":0,"d":"0.00"},{"v":0,"d":"0.00"},{"v":0,"d":"0.00"},"00:00:00","00:00:00","00:00:00","00:00:00","00:00:00","00:00:00",{"v":0,"d":"0.00"},{"v":0,"d":"0.00"},"06:00:00","00:00:00",{"$nulls":16},{"v":0,"d":"0.00"},{"v":0,"d":"0.00"},{"v":0,"d":"0.00"},{"v":0,"d":"0.00"},null,null,{"v":0,"d":"0.00"},{"v":0,"d":"0.00"},{"v":0,"d":"0.00"},{"v":0,"d":"0.00"},null,null,"ja",null,"",null,"ja",null,"ja",6,"",0,{"$f":"VLOOKUP($BW$3,Listen!$I$8:$R$26,10)","v":157},"Fronleichnam"]
["Sonntag","2023-01-08","",{"$nulls":7},"00:00:00",null,null,"00:00:00","00:00:00","21:00:00","06:00:00","",1,"00:00:00","00:00:00","00:00:00","00:00:00","00:00:00","00:00:00",{"v":0,"d":"0.00"},{"v":0,"d":"0.00"},{"v":0,"d":"0.00"},{"v":0,"d":"0.00"},{"v":0,"d":"0.00"},false,"00:00:00","00:00:00",{"v":0,"d":"0.00"},{"v":0,"d":"0.00"},{"v":0,"d":"0.00"},{"v":0,"d":"0.00"},{"v":0,"d":"0.00"},{"v":0,"d":"0.00"},{"v":0,"d":"0.00"},"00:00:00","00:00:00","00:00:00","00:00:00","00:00:00","00:00:00",{"v":0,"d":"0.00"},{"v":0,"d":"0.00"},"06:00:00","00:00:00",{"$nulls":16},{"v":0,"d":"0.00"},{"v":0,"d":"0.00"},{"v":0,"d":"0.00"},{"v":0,"d":"0.00"},null,null,{"v":0,"d":"0.00"},{"v":0,"d":"0.00"},{"v":0,"d":"0.00"},{"v":0,"d":"0.00"},null,null,"ja",null,"",null,"ja",null,"ja",7,"",0,null,"Neujahr"]
["Montag","2023-01-09","",{"$nulls":7},"00:00:00",null,null,"00:00:00","00:00:00","21:00:00","06:00:00","",1,"00:00:00","00:00:00","00:00:00","00:00:00","00:00:00","00:00:00",{"v":0,"d":"0.00"},{"v":0,"d":"0.00"},{"v":0,"d":"0.00"},{"v":0,"d":"0.00"},{"v":0,"d":"0.00"},false,"00:00:00","00:00:00",{"v":0,"d":"0.00"},{"v":0,"d":"0.00"},{"v":0,"d":"0.00"},{"v":0,"d":"0.00"},{"v":0,"d":"0.00"},{"v":0,"d":"0.00"},{"v":0,"d":"0.00"},"00:00:00","00:00:00","00:00:00","00:00:00","00:00:00","00:00:00",{"v":0,"d":"0.00"},{"v":0,"d":"0.00"},"06:00:00","00:00:00",{"$nulls":16},{"v":0,"d":"0.00"},{"v":0,"d":"0.00"},{"v":0,"d":"0.00"},{"v":0,"d":"0.00"},null,null,{"v":0,"d":"0.00"},{"v":0,"d":"0.00"},{"v":0,"d":"0.00"},{"v":0,"d":"0.00"},null,null,"",null,"ja",null,"ja",null,"ja",8,"",0,{"$f":"274+CI9","v":274},"Tag d.de.Einheit"]
["Dienstag","2023-01-10","",{"$nulls":7},"00:00:00",null,null,"00:00:00","00:00:00","21:00:00","06:00:00","",1,"00:00:00","00:00:00","00:00:00","00:00:00","00:00:00","00:00:00",{"v":0,"d":"0.00"},{"v":0,"d":"0.00"},{"v":0,"d":"0.00"},{"v":0,"d":"0.00"},{"v":0,"d":"0.00"},false,"00:00:00","00:00:00",{"v":0,"d":"0.00"},{"v":0,"d":"0.00"},{"v":0,"d":"0.00"},{"v":0,"d":"0.00"},{"v":0,"d":"0.00"},{"v":0,"d":"0.00"},{"v":0,"d":"0.00"},"00:00:00","00:00:00","00:00:00","00:00:00","00:00:00","00:00:00",{"v":0,"d":"0.00"},{"v":0,"d":"0.00"},"06:00:00","00:00:00",{"$nulls":16},{"v":0,"d":"0.00"},{"v":0,"d":"0.00"},{"v":0,"d":"0.00"},{"v":0,"d":"0.00"},null,null,{"v":0,"d":"0.00"},{"v":0,"d":"0.00"},{"v":0,"d":"0.00"},{"v":0,"d":"0.00"},null,null,"",null,"ja",null,"ja",null,"ja",9,"",0,{"$f":"303+CI9","v":303},"Allerheiligen"]
["Mittwoch","2023-01-11","",{"$nulls":7},"00:00:00",null,null,"00:00:00","00:00:00","21:00:00","06:00:00","",1,"00:00:00","00:00:00","00:00:00","00:00:00","00:00:00","00:00:00",{"v":0,"d":"0.00"},{"v":0,"d":"0.00"},{"v":0,"d":"0.00"},{"v":0,"d":"0.00"},{"v":0,"d":"0.00"},false,"00:00:00","00:00:00",{"v":0,"d":"0.00"},{"v":0,"d":"0.00"},{"v":0,"d":"0.00"},{"v":0,"d":"0.00"},{"v":0,"d":"0.00"},{"v":0,"d":"0.00"},{"v":0,"d":"0.00"},"00:00:00","00:00:00","00:00:00","00:00:00","00:00:00","00:00:00",{"v":0,"d":"0.00"},{"v":0,"d":"0.00"},"06:00:00","00:00:00",{"$nulls":16},{"v":0,"d":"0.00"},{"v":0,"d":"0.00"},{"v":0,"d":"0.00"},{"v":0,"d":"0.00"},null,null,{"v":0,"d":"0.00"},{"v":0,"d":"0.00"},{"v":0,"d":"0.00"},{"v":0,"d":"0.00"},null,null,"",null,"ja",null,"ja",null,"ja",10,"",0]
["Donnerstag","2023-01-12","",{"$nulls":7},"00:00:00",null,null,"00:00:00","00:00:00","21:00:00","06:00:00","",1,"00:00:00","00:00:00","00:00:00","00:00:00","00:00:00","00:00:00",{"v":0,"d":"0.00"},{"v":0,"d":"0.00"},{"v":0,"d":"0.00"},{"v":0,"d":"0.00"},{"v":0,"d":"0.00"},false,"00:00:00","00:00:00",{"v":0,"d":"0.00"},{"v":0,"d":"0.00"},{"v":0,"d":"0.00"},{"v":0,"d":"0.00"},{"v":0,"d":"0.00"},{"v":0,"d":"0.00"},{"v":0,"d":"0.00"},"00:00:00","00:00:00","00:00:00","00:00:00","00:00:00","00:00:00",{"v":0,"d":"0.00"},{"v":0,"d":"0.00"},"06:00:00","00:00:00",{"$nulls":16},{"v":0,"d":"0.00"},{"v":0,"d":"0.00"},{"v":0,"d":"0.00"},{"v":0,"d":"0.00"},null,null,{"v":0,"d":"0.00"},{"v":0,"d":"0.00"},{"v":0,"d":"0.00"},{"v":0,"d":"0.00"},null,null,"",null,"ja",null,"ja",null,"ja",11,"",0]
["Freitag","2023-01-13","",{"$nulls":7},"00:00:00",null,null,"00:00:00","00:00:00","21:00:00","06:00:00","",1,"00:00:00","00:00:00","00:00:00","00:00:00","00:00:00","00:00:00",{"v":0,"d":"0.00"},{"v":0,"d":"0.00"},{"v":0,"d":"0.00"},{"v":0,"d":"0.00"},{"v":0,"d":"0.00"},false,"00:00:00","00:00:00",{"v":0,"d":"0.00"},{"v":0,"d":"0.00"},{"v":0,"d":"0.00"},{"v":0,"d":"0.00"},{"v":0,"d":"0.00"},{"v":0,"d":"0.00"},{"v":0,"d":"0.00"},"00:00:00","00:00:00","00:00:00","00:00:00","00:00:00","00:00:00",{"v":0,"d":"0.00"},{"v":0,"d":"0.00"},"06:00:00","00:00:00",{"$nulls":16},{"v":0,"d":"0.00"},{"v":0,"d":"0.00"},{"v":0,"d":"0.00"},{"v":0,"d":"0.00"},null,null,{"v":0,"d":"0.00"},{"v":0,"d":"0.00"},{"v":0,"d":"0.00"},{"v":0,"d":"0.00"},null,null,"",null,"ja",null,"ja",null,"ja",12,"",0]
["Samstag","2023-01-14","",{"$nulls":7},"00:00:00",null,null,"00:00:00","00:00:00","21:00:00","06:00:00","",1,"00:00:00","00:00:00","00:00:00","00:00:00","00:00:00","00:00:00",{"v":0,"d":"0.00"},{"v":0,"d":"0.00"},{"v":0,"d":"0.00"},{"v":0,"d":"0.00"},{"v":0,"d":"0.00"},false,"00:00:00","00:00:00",{"v":0,"d":"0.00"},{"v":0,"d":"0.00"},{"v":0,"d":"0.00"},{"v":0,"d":"0.00"},{"v":0,"d":"0.00"},{"v":0,"d":"0.00"},{"v":0,"d":"0.00"},"00:00:00","00:00:00","00:00:00","00:00:00","00:00:00","00:00:00",{"v":0,"d":"0.00"},{"v":0,"d":"0.00"},"06:00:00","00:00:00",{"$nulls":16},{"v":0,"d":"0.00"},{"v":0,"d":"0.00"},{"v":0,"d":"0.00"},{"v":0,"d":"0.00"},null,null,{"v":0,"d":"0.00"},{"v":0,"d":"0.00"},{"v":0,"d":"0.00"},{"v":0,"d":"0.00"},null,null,"ja",null,"",null,"ja",null,"ja",13,"",0]
["Sonntag","2023-01-15","",{"$nulls":7},"00:00:00",null,null,"00:00:00","00:00:00","21:00:00","06:00:00","",1,"00:00:00","00:00:00","00:00:00","00:00:00","00:00:00","00:00:00",{"v":0,"d":"0.00"},{"v":0,"d":"0.00"},{"v":0,"d":"0.00"},{"v":0,"d":"0.00"},{"v":0,"d":"0.00"},false,"00:00:00","00:00:00",{"v":0,"d":"0.00"},{"v":0,"d":"0.00"},{"v":0,"d":"0.00"},{"v":0,"d":"0.00"},{"v":0,"d":"0.00"},{"v":0,"d":"0.00"},{"v":0,"d":"0.00"},"00:00:00","00:00:00","00:00:00","00:00:00","00:00:00","00:00:00",{"v":0,"d":"0.00"},{"v":0,"d":"0.00"},"06:00:00","00:00:00",{"$nulls":16},{"v":0,"d":"0.00"},{"v":0,"d":"0.00"},{"v":0,"d":"0.00"},{"v":0,"d":"0.00"},null,null,{"v":0,"d":"0.00"},{"v":0,"d":"0.00"},{"v":0,"d":"0.00"},{"v":0,"d":"0.00"},null,null,"ja",null,"",null,"ja",null,"ja",14,"",0]
["Montag","2023-01-16","",{"$nulls":7},"00:00:00",null,null,"00:00:00","00:00:00","21:00:00","06:00:00","",1,"00:00:00","00:00:00","00:00:00","00:00:00","00:00:00","00:00:00",{"v":0,"d":"0.00"},{"v":0,"d":"0.00"},{"v":0,"d":"0.00"},{"v":0,"d":"0.00"},{"v":0,"d":"0.00"},false,"00:00:00","00:00:00",{"v":0,"d":"0.00"},{"v":0,"d":"0.00"},{"v":0,"d":"0.00"},{"v":0,"d":"0.00"},{"v":0,"d":"0.00"},{"v":0,"d":"0.00"},{"v":0,"d":"0.00"},"00:00:00","00:00:00","00:00:00","00:00:00","00:00:00","00:00:00",{"v":0,"d":"0.00"},{"v":0,"d":"0.00"},"06:00:00","00:00:00",{"$nulls":16},{"v":0,"d":"0.00"},{"v":0,"d":"0.00"},{"v":0,"d":"0.00"},{"v":0,"d":"0.00"},null,null,{"v":0,"d":"0.00"},{"v":0,"d":"0.00"},{"v":0,"d":"0.00"},{"v":0,"d":"0.00"},null,null,"",null,"ja",null,"ja",null,"ja",15,"",0]
["Dienstag","2023-01-17","",{"$nulls":7},"00:00:00",null,null,"00:00:00","00:00:00","21:00:00","06:00:00","",1,"00:00:00","00:00:00","00:00:00","00:00:00","00:00:00","00:00:00",{"v":0,"d":"0.00"},{"v":0,"d":"0.00"},{"v":0,"d":"0.00"},{"v":0,"d":"0.00"},{"v":0,"d":"0.00"},false,"00:00:00","00:00:00",{"v":0,"d":"0.00"},{"v":0,"d":"0.00"},{"v":0,"d":"0.00"},{"v":0,"d":"0.00"},{"v":0,"d":"0.00"},{"v":0,"d":"0.00"},{"v":0,"d":"0.00"},"00:00:00","00:00:00","00:00:00","00:00:00","00:00:00","00:00:00",{"v":0,"d":"0.00"},{"v":0,"d":"0.00"},"06:00:00","00:00:00",{"$nulls":16},{"v":0,"d":"0.00"},{"v":0,"d":"0.00"},{"v":0,"d":"0.00"},{"v":0,"d":"0.00"},null,null,{"v":0,"d":"0.00"},{"v":0,"d":"0.00"},{"v":0,"d":"0.00"},{"v":0,"d":"0.00"},null,null,"",null,"ja",null,"ja",null,"ja",16,"",0]
["Mittwoch","2023-01-18","",{"$nulls":7},"00:00:00",null,null,"00:00:00","00:00:00","21:00:00","06:00:00","",1,"00:00:00","00:00:00","00:00:00","00:00:00","00:00:00","00:00:00",{"v":0,"d":"0.00"},{"v":0,"d":"0.00"},{"v":0,"d":"0.00"},{"v":0,"d":"0.00"},{"v":0,"d":"0.00"},false,"00:00:00","00:00:00",{"v":0,"d":"0.00"},{"v":0,"d":"0.00"},{"v":0,"d":"0.00"},{"v":0,"d":"0.00"},{"v":0,"d":"0.00"},{"v":0,"d":"0.00"},{"v":0,"d":"0.00"},"00:00:00","00:00:00","00:00:00","00:00:00","00:00:00","00:00:00",{"v":0,"d":"0.00"},{"v":0,"d":"0.00"},"06:00:00","00:00:00",{"$nulls":16},{"v":0,"d":"0.00"},{"v":0,"d":"0.00"},{"v":0,"d":"0.00"},{"v":0,"d":"0.00"},null,null,{"v":0,"d":"0.00"},{"v":0,"d":"0.00"},{"v":0,"d":"0.00"},{"v":0,"d":"0.00"},null,null,"",null,"ja",null,"ja",null,"ja",17,"",0]
["Donnerstag","2023-01-19","",{"$nulls":7},"00:00:00",null,null,"00:00:00","00:00:00","21:00:00","06:00:00","",1,"00:00:00","00:00:00","00:00:00","00:00:00","00:00:00","00:00:00",{"v":0,"d":"0.00"},{"v":0,"d":"0.00"},{"v":0,"d":"0.00"},{"v":0,"d":"0.00"},{"v":0,"d":"0.00"},false,"00:00:00","00:00:00",{"v":0,"d":"0.00"},{"v":0,"d":"0.00"},{"v":0,"d":"0.00"},{"v":0,"d":"0.00"},{"v":0,"d":"0.00"},{"v":0,"d":"0.00"},{"v":0,"d":"0.00"},"00:00:00","00:00:00","00:00:00","00:00:00","00:00:00","00:00:00",{"v":0,"d":"0.00"},{"v":0,"d":"0.00"},"06:00:00","00:00:00",{"$nulls":16},{"v":0,"d":"0.00"},{"v":0,"d":"0.00"},{"v":0,"d":"0.00"},{"v":0,"d":"0.00"},null,null,{"v":0,"d":"0.00"},{"v":0,"d":"0.00"},{"v":0,"d":"0.00"},{"v":0,"d":"0.00"},null,null,"",null,"ja",null,"ja",null,"ja",18,"",0]
["Freitag","2023-01-20","",{"$nulls":7},"00:00:00",null,null,"00:00:00","00:00:00","21:00:00","06:00:00","",1,"00:00:00","00:00:00","00:00:00","00:00:00","00:00:00","00:00:00",{"v":0,"d":"0.00"},{"v":0,"d":"0.00"},{"v":0,"d":"0.00"},{"v":0,"d":"0.00"},{"v":0,"d":"0.00"},false,"00:00:00","00:00:00",{"v":0,"d":"0.00"},{"v":0,"d":"0.00"},{"v":0,"d":"0.00"},{"v":0,"d":"0.00"},{"v":0,"d":"0.00"},{"v":0,"d":"0.00"},{"v":0,"d":"0.00"},"00:00:00","00:00:00","00:00:00","00:00:00","00:00:00","00:00:00",{"v":0,"d":"0.00"},{"v":0,"d":"0.00"},"06:00:00","00:00:00",{"$nulls":16},{"v":0,"d":"0.00"},{"v":0,"d":"0.00"},{"v":0,"d":"0.00"},{"v":0,"d":"0.00"},null,null,{"v":0,"d":"0.00"},{"v":0,"d":"0.00"},{"v":0,"d":"0.00"},{"v":0,"d":"0.00"},null,null,"",null,"ja",null,"ja",null,"ja",19,"",0]
["Samstag","2023-01-21","",{"$nulls":7},"00:00:00",null,null,"00:00:00","00:00:00","21:00:00","06:00:00","",1,"00:00:00","00:00:00","00:00:00","00:00:00","00:00:00","00:00:00",{"v":0,"d":"0.00"},{"v":0,"d":"0.00"},{"v":0,"d":"0.00"},{"v":0,"d":"0.00"},{"v":0,"d":"0.00"},false,"00:00:00","00:00:00",{"v":0,"d":"0.00"},{"v":0,"d":"0.00"},{"v":0,"d":"0.00"},{"v":0,"d":"0.00"},{"v":0,"d":"0.00"},{"v":0,"d":"0.00"},{"v":0,"d":"0.00"},"00:00:00","00:00:00","00:00:00","00:00:00","00:00:00","00:00:00",{"v":0,"d":"0.00"},{"v":0,"d":"0.00"},"06:00:00","00:00:00",{"$nulls":16},{"v":0,"d":"0.00"},{"v":0,"d":"0.00"},{"v":0,"d":"0.00"},{"v":0,"d":"0.00"},null,null,{"v":0,"d":"0.00"},{"v":0,"d":"0.00"},{"v":0,"d":"0.00"},{"v":0,"d":"0.00"},null,null,"ja",null,"",null,"ja",null,"ja",20,"",0]
["Sonntag","2023-01-22","",{"$nulls":7},"00:00:00",null,null,"00:00:00","00:00:00","21:00:00","06:00:00","",1,"00:00:00","00:00:00","00:00:00","00:00:00","00:00:00","00:00:00",{"v":0,"d":"0.00"},{"v":0,"d":"0.00"},{"v":0,"d":"0.00"},{"v":0,"d":"0.00"},{"v":0,"d":"0.00"},false,"00:00:00","00:00:00",{"v":0,"d":"0.00"},{"v":0,"d":"0.00"},{"v":0,"d":"0.00"},{"v":0,"d":"0.00"},{"v":0,"d":"0.00"},{"v":0,"d":"0.00"},{"v":0,"d":"0.00"},"00:00:00","00:00:00","00:00:00","00:00:00","00:00:00","00:00:00",{"v":0,"d":"0.00"},{"v":0,"d":"0.00"},"06:00:00","00:00:00",{"$nulls":16},{"v":0,"d":"0.00"},{"v":0,"d":"0.00"},{"v":0,"d":"0.00"},{"v":0,"d":"0.00"},null,null,{"v":0,"d":"0.00"},{"v":0,"d":"0.00"},{"v":0,"d":"0.00"},{"v":0,"d":"0.00"},null,null,"ja",null,"",null,"ja",null,"ja",21,"",0]
["Montag","2023-01-23","",{"$nulls":7},"00:00:00",null,null,"00:00:00","00:00:00","21:00:00","06:00:00","",1,"00:00:00","00:00:00","00:00:00","00:00:00","00:00:00","00:00:00",{"v":0,"d":"0.00"},{"v":0,"d":"0.00"},{"v":0,"d":"0.00"},{"v":0,"d":"0.00"},{"v":0,"d":"0.00"},false,"00:00:00","00:00:00",{"v":0,"d":"0.00"},{"v":0,"d":"0.00"},{"v":0,"d":"0.00"},{"v":0,"d":"0.00"},{"v":0,"d":"0.00"},{"v":0,"d":"0.00"},{"v":0,"d":"0.00"},"00:00:00","00:00:00","00:00:00","00:00:00","00:00:00","00:00:00",{"v":0,"d":"0.00"},{"v":0,"d":"0.00"},"06:00:00","00:00:00",{"$nulls":16},{"v":0,"d":"0.00"},{"v":0,"d":"0.00"},{"v":0,"d":"0.00"},{"v":0,"d":"0.00"},null,null,{"v":0,"d":"0.00"},{"v":0,"d":"0.00"},{"v":0,"d":"0.00"},{"v":0,"d":"0.00"},null,null,"",null,"ja",null,"ja",null,"ja",22,"",0]
["Dienstag","2023-01-24",{"$f":"IF(CJ33=1,CI33,\"\")","v":""},{"$nulls":7},"00:00:00",null,null,"00:00:00","00:00:00","21:00:00","06:00:00","",1,"00:00:00","00:00:00","00:00:00","00:00:00","00:00:00","00:00:00",{"v":0,"d":"0.00"},{"v":0,"d":"0.00"},{"v":0,"d":"0.00"},{"v":0,"d":"0.00"},{"v":0,"d":"0.00"},false,"00:00:00","00:00:00",{"v":0,"d":"0.00"},{"v":0,"d":"0.00"},{"v":0,"d":"0.00"},{"v":0,"d":"0.00"},{"v":0,"d":"0.00"},{"v":0,"d":"0.00"},{"v":0,"d":"0.00"},"00:00:00","00:00:00","00:00:00","00:00:00","00:00:00","00:00:00",{"v":0,"d":"0.00"},{"v":0,"d":"0.00"},"06:00:00","00:00:00",{"$f":"IF(I33=\"\",0,IF(OR(I33>=AW33,I33<=AX33),1,IF(OR(J33>=AW33,J33<=AX33),1,IF(AND(I33<=TR33,J33>=AX33,J33<I33),1,0))))","v":0},{"$f":"(J33+$D$6)*24","v":{"v":0,"d":"0.00"}},{"v":24,"d":"24.00"},{"v":14,"d":"14.00"},{"$f":"IF(I33=\"\",0,IF(AY33,IF(AND((I33-$D$6)<=AW33,(I33-$D$6)>=AX33),AW33,IF(OR((I33-$D$6)>=AW33,(I33-$D$6)<=AX33),I33-$D$6,AW33)),0))","v":"00:00:00"},{"$f":"IF(OR(J33=\"\",AY33=0),0,IF(AY33=1,IF(AZ33>BA33,AX33,J33+$D$6)))","v":"00:00:00"},{"$f":"IF(I33=\"\",0,IF(AY33,IF(AND(I33<=AW33,I33>=AX33),AW33,IF(OR(I33>=AW33,I33<=AX33),I33,AW33)),0))","v":"00:00:00"},{"$f":"IF(OR(AY33=0,J33=0),0,IF(J33<=AX33,J33,IF(J33>=AW33,J33,AX33)))","v":"00:00:00"},{"$f":"IF(BE33=0,0,IF(BE33<=0.25,BD33-BC33,(BD33+1)-BC33))","v":"00:00:00"},{"$f":"IF(BE33=0,0,IF(BE33<=0.25,BF33-BE33,(BF33+1)-BE33))","v":"00:00:00"},{"$f":"BC33*24","v":{"v":0,"d":"0.00"}},{"$f":"BD33*24","v":{"v":0,"d":"0.00"}},{"$f":"BE33*24","v":{"v":0,"d":"0.00"}},{"$f":"BF33*24","v":{"v":0,"d":"0.00"}},{"$f":"IF(AND(I33>0,$BU$3=12,BI33<=BB33),BB33-BI33,0)","v":{"v":0,"d":"0.00"}},{"$f":"IF(AND(I33>0,BJ33>BB33,S33=1),IF(BI33-BB33<0,BG33*24-24-BM33,BI33-BB33),IF(BL33>BB33,BB33-BK33,0))","v":{"v":0,"d":"0.00"}},{"v":0,"d":"0.00"},{"v":0,"d":"0.00"},{"$f":"IF(BU3=12,0,IF(C33=\"\",IF(AH33=0,0,IF(AH33>=0,AH33-BR33,IF(AND(AH33>=0,BV33>=0,$BV$5=\"ja\"),AH33-BV33,IF(AND(AH33>=0,BW33>=0,$BV$5=\"nein\"),AH33-BW33)))),0))","v":{"v":0,"d":"0.00"}},{"v":0,"d":"0.00"},{"$f":"IF($BU$3=12,BN33,0)","v":{"v":0,"d":"0.00"}},{"$f":"IF(AND($BU$3=12,BJ33>BB33,BJ33<=BA33),SUM(BJ33-IF(BI33>14,BI33,14)),IF(AND($BU$3=12,BL33>14,BL33<=BA33),SUM(IF(BL33-14>0,BL33,14)),0))","v":{"v":0,"d":"0.00"}},{"v":0,"d":"0.00"},{"v":0,"d":"0.00"},{"v":0,"d":"0.00"},{"v":0,"d":"0.00"},null,null,{"$f":"IF(OR(D33=\"ja\",E33=\"ja\"),\"\",IF(OR(CJ33=1,TEXT(B33,\"TTTT\")=\"Samstag\",TEXT(B33,\"TTTT\")=\"Sonntag\"),\"ja\",\"\"))","v":""},null,"ja",null,"ja",null,"ja",23,"",0]
["Mittwoch","2023-01-25",{"$f":"IF(BU3=12,\"1. Weihnach.\",IF(CJ34=1,CI34,\"\"))","v":""},{"$nulls":7},"00:00:00",null,null,"00:00:00","00:00:00","21:00:00","06:00:00","",1,"00:00:00","00:00:00","00:00:00","00:00:00","00:00:00","00:00:00",{"v":0,"d":"0.00"},{"v":0,"d":"0.00"},{"v":0,"d":"0.00"},{"v":0,"d":"0.00"},{"v":0,"d":"0.00"},false,"00:00:00","00:00:00",{"v":0,"d":"0.00"},{"v":0,"d":"0.00"},{"v":0,"d":"0.00"},{"v":0,"d":"0.00"},{"v":0,"d":"0.00"},{"v":0,"d":"0.00"},{"v":0,"d":"0.00"},"00:00:00","00:00:00","00:00:00","00:00:00","00:00:00","00:00:00",{"v":0,"d":"0.00"},{"v":0,"d":"0.00"},"06:00:00","00:00:00",{"$f":"IF(I34=\"\",0,IF(OR(I34>=AW34,I34<=AX34),1,IF(OR(J34>=AW34,J34<=AX34),1,IF(AND(I34<=TR34,J34>=AX34,J34<I34),1,0))))","v":0},{"$f":"(J34+$D$6)*24","v":{"v":0,"d":"0.00"}},{"v":24,"d":"24.00"},{"v":0,"d":"0.00"},{"$f":"I34*24","v":{"v":0,"d":"0.00"}},{"$f":"IF(OR(J34=\"\",AY34=0),0,IF(AY34=1,IF(AZ34>BA34,AX34,J34+$D$6)))","v":0},{"$f":"IF(I34=\"\",0,IF(AY34,IF(AND(I34<=AW34,I34>=AX34),AX34,IF(OR(I34>=AW34,I34<=AX34),I34,AW34)),0))","v":0},{"$f":"IF(OR(AY34=0,J34=0),0,IF(J34<=AX34,J34,IF(J34>=AW34,J34,AX34)))","v":"00:00:00"},null,{"$f":"IF(BE34=0,0,IF(BE34<=0.25,BF34-BE34,(BF34+1)-BE34))","v":"00:00:00"},{"$f":"IF(I34=\"\",0,IF(AY34,IF(AND((BC34-$G$6)<=BB34,),BB34,IF(OR((BC34-$G$6)>=BB34),BC34-$G$6,BB34)),0))","v":{"v":0,"d":"0.00"}},{"$f":"BD34*24","v":{"v":0,"d":"0.00"}},{"$f":"I34*24","v":{"v":0,"d":"0.00"}},{"$f":"BF34*24","v":{"v":0,"d":"0.00"}},{"$f":"BJ34-BI34","v":{"v":0,"d":"0.00"}},{"$f":"BL34-BK34","v":{"v":0,"d":"0.00"}},{"v":0,"d":"0.00"},{"v":0,"d":"0.00"},{"$f":"IF(BU3=12,0,IF(C34=\"\",IF(AH34=0,0,IF(AH34>=0,AH34-BR34,IF(AND(AH34>=0,BV34>=0,$BV$5=\"ja\"),AH34-BV34,IF(AND(AH34>=0,BW34>=0,$BV$5=\"nein\"),AH34-BW34)))),0))","v":{"v":0,"d":"0.00"}},{"v":0,"d":"0.00"},{"$f":"IF($BU$3=12,BN34,0)","v":{"v":0,"d":"0.00"}},{"$f":"IF(AND(BU3=12,K34>0),IF(S34=1,BM34,BN34),0)","v":{"v":0,"d":"0.00"}},{"v":0,"d":"0.00"},{"$f":"IF($BV$5=\"ja\",IF(OR(K34=\"\",C34=\"\",C34=\"1. Weihnach.\",C34=\"2. Weihnach.\"),0,IF(AND(S34=1,K34>0),(K34+$D$6+$D$6)*24,K34*24)),0)","v":{"v":0,"d":"0.00"}},{"v":0,"d":"0.00"},{"v":0,"d":"0.00"},null,null,{"$f":"IF(BU3=12,\"ja\",IF(OR(D34=\"ja\",E34=\"ja\"),\"\",IF(OR(CJ34=1,TEXT(B34,\"TTTT\")=\"Samstag\",TEXT(B34,\"TTTT\")=\"Sonntag\"),\"ja\",\"\")))","v":""},null,"ja",null,"ja",null,"ja",24,"",0]
["Donnerstag","2023-01-26",{"$f":"IF(BU3=12,\"2. Weihnach.\",IF(CJ35=1,CI35,\"\"))","v":""},{"$nulls":7},"00:00:00",null,null,"00:00:00","00:00:00","21:00:00","06:00:00","",1,"00:00:00","00:00:00","00:00:00","00:00:00","00:00:00","00:00:00",{"v":0,"d":"0.00"},{"v":0,"d":"0.00"},{"v":0,"d":"0.00"},{"v":0,"d":"0.00"},{"v":0,"d":"0.00"},false,"00:00:00","00:00:00",{"v":0,"d":"0.00"},{"v":0,"d":"0.00"},{"v":0,"d":"0.00"},{"v":0,"d":"0.00"},{"v":0,"d":"0.00"},{"v":0,"d":"0.00"},{"v":0,"d":"0.00"},"00:00:00","00:00:00","00:00:00","00:00:00","00:00:00","00:00:00",{"v":0,"d":"0.00"},{"v":0,"d":"0.00"},"06:00:00","00:00:00",{"$f":"IF(I35=\"\",0,IF(OR(I35>=AW35,I35<=AX35),1,IF(OR(J35>=AW35,J35<=AX35),1,IF(AND(I35<=TR35,J35>=AX35,J35<I35),1,0))))","v":0},{"$f":"(J35+$D$6)*24","v":{"v":0,"d":"0.00"}},{"v":24,"d":"24.00"},{"v":0,"d":"0.00"},{"$f":"I35*24","v":{"v":0,"d":"0.00"}},{"$f":"IF(OR(J35=\"\",AY35=0),0,IF(AY35=1,IF(AZ35>BA35,AX35,J35+$D$6)))","v":0},{"$f":"IF(I35=\"\",0,IF(AY35,IF(AND(I35<=AW35,I35>=AX35),AX35,IF(OR(I35>=AW35,I35<=AX35),I35,AW35)),0))","v":0},{"$f":"IF(OR(AY35=0,J35=0),0,IF(J35<=AX35,J35,IF(J35>=AW35,J35,AX35)))","v":"00:00:00"},null,{"$f":"IF(BE35=0,0,IF(BE35<=0.25,BF35-BE35,(BF35+1)-BE35))","v":"00:00:00"},{"$f":"IF(I35=\"\",0,IF(AY35,IF(AND((BC35-$G$6)<=BB35,),BB35,IF(OR((BC35-$G$6)>=BB35),BC35-$G$6,BB35)),0))","v":{"v":0,"d":"0.00"}},{"$f":"BD35*24","v":{"v":0,"d":"0.00"}},{"$f":"I35*24","v":{"v":0,"d":"0.00"}},{"$f":"BF35*24","v":{"v":0,"d":"0.00"}},{"$f":"BJ35-BI35","v":{"v":0,"d":"0.00"}},{"$f":"BL35-BK35","v":{"v":0,"d":"0.00"}},{"v":0,"d":"0.00"},{"v":0,"d":"0.00"},{"$f":"IF(BU3=12,0,IF(C35=\"\",IF(AH35=0,0,IF(AH35>=0,AH35-BR35,IF(AND(AH35>=0,BV35>=0,$BV$5=\"ja\"),AH35-BV35,IF(AND(AH35>=0,BW35>=0,$BV$5=\"nein\"),AH35-BW35)))),0))","v":{"v":0,"d":"0.00"}},{"v":0,"d":"0.00"},{"$f":"IF($BU$3=12,BN35,0)","v":{"v":0,"d":"0.00"}},{"$f":"IF(AND(BU3=12,K35>0),IF(S35=1,BM35,BN35),0)","v":{"v":0,"d":"0.00"}},{"v":0,"d":"0.00"},{"v":0,"d":"0.00"},{"v":0,"d":"0.00"},{"v":0,"d":"0.00"},null,null,{"$f":"IF(BU3=12,\"ja\",IF(OR(D35=\"ja\",E35=\"ja\"),\"\",IF(OR(CJ35=1,TEXT(B35,\"TTTT\")=\"Samstag\",TEXT(B35,\"TTTT\")=\"Sonntag\"),\"ja\",\"\")))","v":""},null,{"$f":"IF(OR(D35=\"ja\",E35=\"ja\"),\"\",IF(CA35=\"ja\",\"\",\"ja\"))","v":"ja"},null,"ja",null,"ja",25,"",{"$f":"IF(OR(CH35=CK$10,,CH35=CK$12,CH35=CK$13,CH35=CK$14,CH35=CK$15,CH35=CK$16,,CH35=CK$18,CH35=CK$19),1,0)","v":0}]
["Freitag","2023-01-27","",{"$nulls":7},"00:00:00",null,null,"00:00:00","00:00:00","21:00:00","06:00:00","",1,"00:00:00","00:00:00","00:00:00","00:00:00","00:00:00","00:00:00",{"v":0,"d":"0.00"},{"v":0,"d":"0.00"},{"v":0,"d":"0.00"},{"v":0,"d":"0.00"},{"v":0,"d":"0.00"},false,"00:00:00","00:00:00",{"v":0,"d":"0.00"},{"v":0,"d":"0.00"},{"v":0,"d":"0.00"},{"v":0,"d":"0.00"},{"v":0,"d":"0.00"},{"v":0,"d":"0.00"},{"v":0,"d":"0.00"},"00:00:00","00:00:00","00:00:00","00:00:00","00:00:00","00:00:00",{"v":0,"d":"0.00"},{"v":0,"d":"0.00"},"06:00:00","00:00:00",{"$nulls":16},{"v":0,"d":"0.00"},{"v":0,"d":"0.00"},{"v":0,"d":"0.00"},{"v":0,"d":"0.00"},{"v":0,"d":"0.00"},null,{"v":0,"d":"0.00"},{"v":0,"d":"0.00"},{"v":0,"d":"0.00"},{"v":0,"d":"0.00"},null,null,"",null,"ja",null,"ja",null,"ja",26,"",0]
["Samstag","2023-01-28","",{"$nulls":7},"00:00:00",null,null,"00:00:00","00:00:00","21:00:00","06:00:00","",1,"00:00:00","00:00:00","00:00:00","00:00:00","00:00:00","00:00:00",{"v":0,"d":"0.00"},{"v":0,"d":"0.00"},{"v":0,"d":"0.00"},{"v":0,"d":"0.00"},{"v":0,"d":"0.00"},false,"00:00:00","00:00:00",{"v":0,"d":"0.00"},{"v":0,"d":"0.00"},{"v":0,"d":"0.00"},{"v":0,"d":"0.00"},{"v":0,"d":"0.00"},{"v":0,"d":"0.00"},{"v":0,"d":"0.00"},"00:00:00","00:00:00","00:00:00","00:00:00","00:00:00","00:00:00",{"v":0,"d":"0.00"},{"v":0,"d":"0.00"},"06:00:00","00:00:00",{"$nulls":16},{"v":0,"d":"0.00"},{"v":0,"d":"0.00"},{"v":0,"d":"0.00"},{"v":0,"d":"0.00"},{"v":0,"d":"0.00"},null,{"v":0,"d":"0.00"},{"v":0,"d":"0.00"},{"v":0,"d":"0.00"},{"v":0,"d":"0.00"},null,null,"ja",null,"",null,"ja",null,"ja",27,"",0]
["Sonntag",{"$f":"IF(MONTH(B37+1)=BU3,B37+1,\"\")","v":"2023-01-29"},{"$f":"IF(B38=\"\",\"\",IF(CJ38=1,CI38,\"\"))","v":""},{"$nulls":7},"00:00:00",null,null,"00:00:00","00:00:00","21:00:00","06:00:00","",1,"00:00:00","00:00:00","00:00:00","00:00:00","00:00:00","00:00:00",{"v":0,"d":"0.00"},{"v":0,"d":"0.00"},{"v":0,"d":"0.00"},{"v":0,"d":"0.00"},{"v":0,"d":"0.00"},false,"00:00:00","00:00:00",{"v":0,"d":"0.00"},{"v":0,"d":"0.00"},{"v":0,"d":"0.00"},{"v":0,"d":"0.00"},{"v":0,"d":"0.00"},{"v":0,"d":"0.00"},{"v":0,"d":"0.00"},"00:00:00","00:00:00","00:00:00","00:00:00","00:00:00","00:00:00",{"v":0,"d":"0.00"},{"v":0,"d":"0.00"},"06:00:00","00:00:00",{"$nulls":16},{"v":0,"d":"0.00"},{"v":0,"d":"0.00"},{"v":0,"d":"0.00"},{"v":0,"d":"0.00"},{"v":0,"d":"0.00"},null,{"v":0,"d":"0.00"},{"v":0,"d":"0.00"},{"v":0,"d":"0.00"},{"v":0,"d":"0.00"},null,null,{"$f":"IF(B38=\"\",\"\",IF(OR(D38=\"ja\",E38=\"ja\"),\"\",IF(OR(CJ38=1,TEXT(B38,\"TTTT\")=\"Samstag\",TEXT(B38,\"TTTT\")=\"Sonntag\"),\"ja\",\"\")))","v":"ja"},null,{"$f":"IF(B38=\"\",\"\",IF(OR(D38=\"ja\",E38=\"ja\"),\"\",IF(CA38=\"ja\",\"\",\"ja\")))","v":""},null,"ja",null,"ja",{"$f":"IF(B38=\"\",\"\",B38-CH$9)","v":28},"",0]
["Montag",{"$f":"IF(MONTH(B37+2)=BU3,B37+2,\"\")","v":"2023-01-30"},{"$f":"IF(B39=\"\",\"\",IF(CJ39=1,CI39,\"\"))","v":""},{"$nulls":7},"00:00:00",null,null,"00:00:00","00:00:00","21:00:00","06:00:00","",1,"00:00:00","00:00:00","00:00:00","00:00:00","00:00:00","00:00:00",{"v":0,"d":"0.00"},{"v":0,"d":"0.00"},{"v":0,"d":"0.00"},{"v":0,"d":"0.00"},{"v":0,"d":"0.00"},false,"00:00:00","00:00:00",{"v":0,"d":"0.00"},{"v":0,"d":"0.00"},{"v":0,"d":"0.00"},{"v":0,"d":"0.00"},{"v":0,"d":"0.00"},{"v":0,"d":"0.00"},{"v":0,"d":"0.00"},"00:00:00","00:00:00","00:00:00","00:00:00","00:00:00","00:00:00",{"v":0,"d":"0.00"},{"v":0,"d":"0.00"},"06:00:00","00:00:00",{"$nulls":16},{"v":0,"d":"0.00"},{"v":0,"d":"0.00"},{"v":0,"d":"0.00"},{"v":0,"d":"0.00"},{"v":0,"d":"0.00"},null,{"v":0,"d":"0.00"},{"v":0,"d":"0.00"},{"v":0,"d":"0.00"},{"v":0,"d":"0.00"},null,null,{"$f":"IF(B39=\"\",\"\",IF(OR(D39=\"ja\",E39=\"ja\"),\"\",IF(OR(CJ39=1,TEXT(B39,\"TTTT\")=\"Samstag\",TEXT(B39,\"TTTT\")=\"Sonntag\"),\"ja\",\"\")))","v":""},null,{"$f":"IF(B39=\"\",\"\",IF(OR(D39=\"ja\",E39=\"ja\"),\"\",IF(CA39=\"ja\",\"\",\"ja\")))","v":"ja"},null,"ja",null,"ja",29,"",0]
["Dienstag",{"$f":"IF(MONTH(B37+3)=BU3,B37+3,\"\")","v":"2023-01-31"},{"$f":"IF(B40=\"\",\"\",IF(CJ40=1,CI40,\"\"))","v":""},{"$nulls":7},"00:00:00",null,null,"00:00:00","00:00:00","21:00:00","06:00:00","",1,"00:00:00","00:00:00","00:00:00","00:00:00","00:00:00","00:00:00",{"v":0,"d":"0.00"},{"v":0,"d":"0.00"},{"v":0,"d":"0.00"},{"v":0,"d":"0.00"},{"v":0,"d":"0.00"},false,"00:00:00","00:00:00",{"v":0,"d":"0.00"},{"v":0,"d":"0.00"},{"v":0,"d":"0.00"},{"v":0,"d":"0.00"},{"v":0,"d":"0.00"},{"v":0,"d":"0.00"},{"v":0,"d":"0.00"},"00:00:00","00:00:00","00:00:00","00:00:00","00:00:00","00:00:00",{"v":0,"d":"0.00"},{"v":0,"d":"0.00"},"06:00:00","00:00:00",{"$f":"IF(I40=\"\",0,IF(OR(I40>=AW40,I40<=AX40),1,IF(OR(J40>=AW40,J40<=AX40),1,IF(AND(I40<=TR40,J40>=AX40,J40<I40),1,0))))","v":0},{"$f":"(J40+$D$6)*24","v":{"v":0,"d":"0.00"}},{"v":24,"d":"24.00"},{"v":14,"d":"14.00"},{"$f":"IF(I40=\"\",0,IF(AY40=1,IF(AND((I40-$D$6)<=AW40,(I40-$D$6)>=AX40),AW40,IF(OR((I40-$D$6)>=AW40,(I40-$D$6)<=AX40),I40-$D$6,AW40)),0))","v":"00:00:00"},{"$f":"IF(OR(J40=\"\",AY40=0),0,IF(AY40=1,IF(AZ40>BA40,AX40,J40+$D$6)))","v":"00:00:00"},{"$f":"IF(I40=\"\",0,IF(AY40,IF(AND(I40<=AW40,I40>=AX40),AW40,IF(OR(I40>=AW40,I40<=AX40),I40,AW40)),0))","v":"00:00:00"},{"$f":"IF(OR(AY40=0,J40=0),0,IF(J40<=AX40,J40,IF(J40>=AW40,J40,AX40)))","v":"00:00:00"},{"$f":"IF(BE40=0,0,IF(BE40<=0.25,BD40-BC40,(BD40+1)-BC40))","v":"00:00:00"},{"$f":"IF(BE40=0,0,IF(BE40<=0.25,BF40-BE40,(BF40+1)-BE40))","v":"00:00:00"},{"$f":"BC40*24","v":{"v":0,"d":"0.00"}},{"$f":"BD40*24","v":{"v":0,"d":"0.00"}},{"$f":"BE40*24","v":{"v":0,"d":"0.00"}},{"$f":"BF40*24","v":{"v":0,"d":"0.00"}},{"$f":"IF(AND(I40>0,$BU$3=12,BI40<=BB40),BJ40-BI40,0)","v":{"v":0,"d":"0.00"}},{"$f":"IF(AND(I40>0,BJ40>BB40,S40=1),IF(BI40-BB40<0,BG40*24-24-BM40,BI40-BB40),IF(BL40>BB40,BB40-BK40,0))","v":{"v":0,"d":"0.00"}},{"$f":"IF(O40=\"\",0,IF($BV$5=\"ja\",O40*24,0))","v":{"v":0,"d":"0.00"}},{"v":0,"d":"0.00"},{"$f":"IF(BU3=12,0,IF(C40=\"\",IF(AH40=0,0,IF(AH40>=0,AH40-BR40,IF(AND(AH40>=0,BV40>=0,$BV$5=\"ja\"),AH40-BV40,IF(AND(AH40>=0,BW40>=0,$BV$5=\"nein\"),AH40-BW40)))),0))","v":{"v":0,"d":"0.00"}},{"v":0,"d":"0.00"},{"$f":"IF($BU$3=12,BN40,0)","v":{"v":0,"d":"0.00"}},{"$f":"IF(AND($BU$3=12,BJ40<BB40,BJ40<=BA40),SUM(BJ40-IF(BI40-BB40>=0,BB40,BI40)),IF(AND($BU$3=12,BL40>14,BL40<=BA40),SUM(IF(BL40-14>0,BL40,14),0)))","v":false},{"v":0,"d":"0.00"},{"v":0,"d":"0.00"},{"v":0,"d":"0.00"},{"v":0,"d":"0.00"},null,null,"",null,"ja",null,"ja",null,"ja",{"$f":"IF(B40=\"\",\"\",B40-CH$9)","v":30},"",0]
[{"$nulls":3},{"$f":"COUNTA(D10:D40)","v":0},{"$f":"COUNTA(E10:E40)","v":0},{"$f":"COUNTA(F10:F40)","v":0},{"$f":"COUNTA(G10:G40)","v":0},{"$f":"SUM(H10:H40)","v":"00:00:00"},null,null,{"$f":"SUM(K10:K40)","v":"00:00:00"},{"$nulls":55},{"$f":"SUM(BO10:BO40)","v":{"v":0,"d":"0.00"}},{"$f":"SUM(BP10:BP40)","v":{"v":0,"d":"0.00"}},{"v":0,"d":"0.00"},{"$f":"SUM(BR10:BR40)","v":{"v":0,"d":"0.00"}},{"v":0,"d":"0.00"},{"$f":"SUM(BT10:BT40)","v":{"v":0,"d":"0.00"}},{"v":0,"d":"0.00"},{"v":0,"d":"0.00"},{"v":0,"d":"0.00"},{"v":0,"d":"0.00"}]
[{"$nulls":3},{"$f":"IF(D41=0,\"\",IF(D41>0,COUNTA(D10:D40),\"\"))","v":""},{"$f":"IF(E41=0,\"\",IF(E41>0,COUNTA(E10:E40),\"\"))","v":""},{"$f":"IF(F41=0,\"\",IF(F41>0,COUNTA(F10:F40),\"\"))","v":""},{"$f":"IF(G41=0,\"\",IF(G41>0,COUNTA(G10:G40),\"\"))","v":""},{"$f":"IF(H41=0,\"\",IF(H41>0,SUM(H10:H40),\"\"))","v":""},{"$nulls":58},{"$f":"IF(BO41=0,\"\",IF(BO41>0,SUM(BO10:BO40),\"\"))","v":""},{"$f":"IF(BP41=0,\"\",IF(BP41>0,SUM(BP10:BP40),\"\"))","v":""},{"$f":"IF(BQ41=0,\"\",IF(BQ41>0,SUM(BQ10:BQ40),\"\"))","v":""},{"$f":"IF(BR41=0,\"\",IF(BR41>0,SUM(BR10:BR40),\"\"))","v":""},{"$f":"IF(BS41=0,\"\",IF(BS41>0,SUM(BS10:BS40),\"\"))","v":""},{"$f":"IF(BT41=0,\"\",IF(BT41>0,SUM(BT10:BT40),\"\"))","v":""},"","","",""]
[null,null,"* Es gelten nur die gesetzlichen Feiertage. Weihnachten und 1. Mai sind unter Lohnart 5071 gesondert berücksichtigt."]
[null,null,"** Auszuwählen ist an jedem Urlaubs- und/oder Krankheitstag jeweils \"ja\". "]
[null,null,"*** Auszuwählen ist \"ja\" nur an dem Tag, an dem die Rufbereitschaft begann."]
[null,null,"**** Bei Einsätzen, für die eine Vor-Ort-Anwensenheit nicht erforderlich war, bitte auf \"ja\" klicken. In diesem Fall wird bei der Berechnung keine Wegezeit berücksichtigt. ",{"$nulls":70},"Stand des Formulars: 01.02.2023"]

{"sheet":"Einsatz 2","index":1,"n_rows":45,"n_cols":76,"rows_kept":45,"merged":[[4,11,4,12]]}
["Nachweis über Überstunden, Überstundenvergütung und Zeitzuschläge ",{"$nulls":72},"Datum:",{"$f":"TODAY()","v":"2023-02-01"}]
[]
[null,null,"2. Einsatz",{"$nulls":5},"Rufbereitschaft und Zeitzuschläge",{"$nulls":62},"Monat:",{"$f":"'Einsatz 1'!BU3","v":1},"Jahr:",{"$f":"'Einsatz 1'!BW3","v":2023}]
[]
[null,null,"Name, Vorname:",{"$f":"'Einsatz 1'!D5","v":0},{"$nulls":6},"Orga-Einheit:",{"$f":"'Einsatz 1'!L5","v":"Dezernat 5.3"},{"$nulls":60},"Freizeitausgleich wird gewährt:",{"$f":"'Einsatz 1'!BV5","v":"ja"}]
[null,null,"Übliche Wegezeit (h:mm):",{"$f":"'Einsatz 1'!D6","v":"00:00:00"},null,"Industriestunden:",{"$f":"D6*24","v":{"v":0,"d":"0.00"}}]
["Tag","Datum","gesetzl. Feiertag in NRW*","Urlaub**","Krankheit (AU)**","Rufbereitschaft Mo-Fr 15:15 bis 07:00 des Folgetags***","Rufbereitschaft Sa, So, Feiertag (07:00 bis 07:00 des Folgetags)***","Rufbereitschaft       weniger als 12 Std.              (hh:mm)","Uhrzeit Einsatz von (hh:mm)","Uhrzeit Einsatz bis (hh:mm)","Arbeitszeit des Einsatzes (ohne Wegezeit)","Der Einsatz erfolgte ohne Präsenz (z.B. telefonisch)****","Grund des Einsatzes ","AZ (ggf. mit WZ)","AZ (ggf. ,mit WZ) gerundet","Beginn Nacht-arbeits-zeit-rahmen","Ende Nacht-arbeits-zeit-rahmen","Nacht-einsatz? \n1-Ja ","Wegezeit 1-ja","Beginn Nacht-einsatz (ohne WZ)","Ende Nacht-einsatz (ohne WZ)","Beginn Nacht-einsatz (mit WZ)","Ende Nachtarbeit (mit WZ)","Nachtarbeit mit WZ","Nachtarbeit ohne WZ","Ende Nacht-einsatz (mit WZ) vor 0","Ende Nacht-einsatz (mit WZ) nach 0","Ende Nacht-einsatz (o WZ) vor 0","Ende Nacht-einsatz (o WZ) nach 0","Summe Nacht-einsatz (mit WZ)","Summe Nacht-einsatz (o WZ)","Samstagsarbeit 13-21 Uhr (mit WZ)","Samstagsarbeit 13-21 Uhr (o WZ)","Samstagsarbeit, wenn negative Zeiten","Beginn Samstags-arbeit o WZ","Beginn Samstags-arbeit m WZ","Ende Samstags-arbeit o WZ","Ende Samstags-arbeit m WZ","Samstagsarbeit 20-21 m WZ","Samstagsarbeit 20-21 o WZ","Beginn Sonntagsarbeit mit WZ","Ende Sonntagsarbeit mit WZ","Beginn Sonntagsarbeit o WZ","Ende Sonntagsarbeit o WZ","Sonntagsarbeit mit WZ","Sonntagsarbeit o WZ","Sonntagsarbeit mit WZ (dezimal)","Sonntagsarbeit o WZ (dezimal)","Beginn Rahmen 24. & 31.12.","Ende Rahmen 24. & 31.12.","Arbeit 24. & 31.12.","Arbeit 24. & 31.12. Ende nach 0 Uhr","Arbeit am 24. & 31.12. (24 h)","Arbeit am 24. & 31.12. (14 h)","Beginn 24.12. & 31.12. (mit WZ)","Ende 24.12. & 31.12. (mit WZ)","Beginn 24.12. & 31.12. (o WZ)","Ende 24.12. & 31.12. (o WZ)","Arbeit 24.12. & 31.12. (mit WZ)","Arbeit 24.12. & 31.12. (o WZ)","Beginn 24.12. & 31.12. (mit WZ)","Ende 24.12. & 31.12. bis 14 Uhr (mit WZ)","Beginn 24.12. & 31.12. (o WZ)","Ende 24.12. & 31.12. bis 14 Uhr (o WZ)","Ende 24. & 31.12. vor 14 Uhr BB32, BC32 dezimal)","Ende 24. & 31.12. nach 14 Uhr","Stunden mit Freizeitausgleich","Stunden ohne Freizeitausgleich","Arbeit am Samstag           13-20 Uhr","Arbeit am Samstag          20-21 Uhr","Arbeit am 24.12.& 31.12. \n 6-14 Uhr","Arbeit am 24.12. 14-24 Uhr; am 25./26.12.           & am 01.05. ","Arbeit am Sonntag","Arbeit am Feiertag mit Freizeitausgleich","Arbeit am Feiertag ohne Freizeitausgleich","Nachtarbeit                 (21-6 Uhr)"]
[{"$nulls":3},5167,5168,5200,5201,5204,{"$nulls":58},5012,"5012 und 5014",5080,5083,5070,5071,5050,5061,"5060 und 5061",5040]
[{"$f":"TEXT(B9,\"TTTT\")","v":"Sonntag"},{"$f":"DATE(BW3,BU3,1)","v":"2023-01-01"},{"$f":"'Einsatz 1'!C10","v":"Neujahr"},{"$f":"'Einsatz 1'!D10","v":0},{"$f":"'Einsatz 1'!E10","v":0},{"$f":"'Einsatz 1'!F10","v":0},{"$f":"'Einsatz 1'!G10","v":0},{"$f":"'Einsatz 1'!H10","v":"00:00:00"},null,null,{"$f":"IF(OR(I9=\"\",J9=\"\"),0,MOD(J9-I9,1))","v":"00:00:00"},null,null,{"$f":"IF(K9=\"\",0,IF(L9=\"\",K9+(2*$D$6),K9))","v":"00:00:00"},{"$f":"IF(J9=\"\",0,(IF(L9=\"ja\",ROUNDUP(N9*48,0.5)/48,ROUNDUP(N9*24,0)/24)))","v":"00:00:00"},"21:00:00","06:00:00",{"$f":"IF(I9=\"\",0,IF(OR(I9>=P9,I9<=Q9),1,IF(OR(J9>=P9,J9<=Q9),1,IF(AND(I9<=P9,J9>=Q9,J9<I9),1,0))))","v":0},{"$f":"IF(L9=\"\",1,\"\")","v":1},{"$f":"IF(OR(I9=\"\",S9=1),0,IF(R9,IF(AND(I9<=P9,I9>=Q9),P9,IF(OR(I9>=P9,I9<=Q9),I9,P9)),0))","v":"00:00:00"},{"$f":"IF(OR(R9=0,J9=\"\",S9=1),0,IF(J9<=Q9,J9,IF(J9>=P9,J9,Q9)))","v":"00:00:00"},{"$f":"IF(OR(I9=\"\",S9=\"\"),0,IF(R9,IF(AND((I9-$D$6)<=P9,(I9-$D$6)>=Q9),P9,IF(OR((I9-$D$6)>=P9,(I9-$D$6)<=Q9),I9-$D$6,P9)),0))","v":"00:00:00"},{"$f":"IF(OR(J9=\"\",S9=\"\"),0,IF(R9,IF(AND((J9+$D$6)<=P9,(J9+$D$6)>=Q9),Q9,IF(OR((J9+$D$6)<=P9,(J9+$D$6)>=Q9),J9+$D$6,Q9)),0))","v":"00:00:00"},{"$f":"IF(AND(S9=\"\",T9=0),0,IF(W9-V9,(W9+1)-V9,0))","v":"00:00:00"},{"$f":"IF(OR(S9=\"1\",T9=0),0,IF(U9-T9,(U9+1)-T9,0))","v":"00:00:00"},{"$f":"IF(W9=0,0,IF(W9<=23.58,X9*24-24))","v":{"v":0,"d":"0.00"}},{"$f":"IF(W9=0,0,IF(W9>0,X9*24))","v":{"v":0,"d":"0.00"}},{"$f":"IF(U9=0,0,IF(U9<=23.58,Y9*24-24))","v":{"v":0,"d":"0.00"}},{"$f":"IF(U9=0,0,IF(U9>0,Y9*24))","v":{"v":0,"d":"0.00"}},{"$f":"IF(AND(S9=1,Z9<=0,AA9<24),AA9,IF(AA9>0,Z9))","v":{"v":0,"d":"0.00"}},{"$f":"IF(AND(S9=\"\",AB9<=0,AC9<24),AC9,IF(AC9>0,AB9))","v":false},{"$f":"IF(AND(F9=0,J9=0),0,IF(AND(A9=\"Samstag\",S9=1),IF(J9>I9,IF(J9>=0.875,0.875,J9+$D$6)-IF(I9<=(13/24),(13/24),I9-$D$6),IF(I9<=0.875,0.875-I9,0)),0))","v":"00:00:00"},{"$f":"IF(S9=1,0,IF(AND(J9=0,F9=0),0,IF(A9=\"Samstag\",IF(J9>I9,IF(J9>=0.875,0.875,J9)-IF(I9<=(13/24),(13/24),I9),IF(I9<=0.875,0.875-I9,0)),0)))","v":"00:00:00"},{"$f":"IF(AG9>0,AG9*24,AF9*24)","v":{"v":0,"d":"0.00"}},{"$f":"IF(AND(A9=\"Samstag\",I9>0,S9=1),0,IF(AND(A9=\"Samstag\",I9>0,S9=\"\"),I9*24,0))","v":{"v":0,"d":"0.00"}},{"$f":"IF(AND(A9=\"Samstag\",I9>0,S9=1),(I9-$D$6)*24,IF(AND(A9=\"Samstag\",I9>0),I9*24,0))","v":{"v":0,"d":"0.00"}},{"$f":"IF(AND(A9=\"Samstag\",J9>0,S9=1),0,IF(AND(A9=\"Samstag\",J9>0,S9=\"\"),J9*24,0))","v":{"v":0,"d":"0.00"}},{"$f":"IF(AND(A9=\"Samstag\",J9>0,S9=1),(J9+$D$6)*24,0)","v":{"v":0,"d":"0.00"}},{"$f":"IF(OR(I9=\"\",L9=\"ja\",AJ9>=21,AND(AJ9<=20,AL9<=20)),0,IF(AND(AJ9<=20,AL9>20,AL9<=21),AL9-20-BV9-BW9,IF(AND(AJ9<=20,AL9>21),21-20-BV9-BW9,IF(AND(AJ9>=20,AJ9<21,AL9>=0,AL9<=12),21-AJ9-BV9-BW9,IF(AND(AJ9<21,OR(AND(AL9>=0,AL9<=21),AND(AL9>=21,AL9<=23.99))),21-20-BV9-BW9)))))","v":{"v":0,"d":"0.00"}},{"$f":"IF(OR(I9=\"\",L9=\"\",AI9>=21,AND(AI9<=20,AK9<=20)),0,IF(AND(AI9<=20,AK9>20,AK9<=21),AK9-20-BV9-BW9,IF(AND(AI9<=20,AK9>21),21-20-BV9-BW9,IF(AND(AI9>=20,AI9<21,AK9>=0,AK9<=12),21-AI9-BV9-BW9,IF(AND(AI9<21,OR(AND(AK9>=0,AK9<=21),AND(AK9>=21,AK9<=23.99))),21-20-BV9-BW9)))))","v":{"v":0,"d":"0.00"}},{"$f":"IF(A9=\"Sonntag\",I9-$D$6,IF(A9=\"Samstag\",IF(J9<I9,0,0),0))","v":"00:00:00"},{"$f":"IF(J9=\"\",0,IF(A9=\"Sonntag\",IF((J9+$D$6)<I9,1,J9+$D$6),IF(A9=\"Samstag\",IF((J9+$D$6)<I9,J9+$D$6,0),0)))","v":"00:00:00"},{"$f":"IF(A9=\"Sonntag\",I9,IF(A9=\"Samstag\",IF(J9<I9,0,0),0))","v":"00:00:00"},{"$f":"IF(A9=\"Sonntag\",IF(J9<I9,1,J9),IF(A9=\"Samstag\",IF(J9<I9,J9,0),0))","v":"00:00:00"},{"$f":"IF(J9=\"\",0,IF(AND(AO9=0,AP9=0),0,IF(OR(A9=\"Sonntag\",A9=\"Samstag\"),AP9-AO9,0)))","v":"00:00:00"},{"$f":"IF(AND(AQ9=0,AR9=0),0,IF(OR(A9=\"Sonntag\",A9=\"Samstag\"),AR9-AQ9,0))","v":"00:00:00"},{"$f":"IF(OR(AS9=0,AS9=\"\"),0,IF(AND(AS9>0,BV9>=0,$BV$5=\"ja\"),AS9*24-BV9,IF(AND(AS9>0,BV9>=0,$BV$5=\"nein\"),AS9*24-BW9)))","v":{"v":0,"d":"0.00"}},{"$f":"IF(OR(AT9=0,AT9=\"\"),0,IF(AND(AT9>0,BV9>=0,$BV$5=\"ja\"),AT9*24-BV9,IF(AND(AT9>0,BV9>=0,$BV$5=\"nein\"),AT9*24-BW9)))","v":{"v":0,"d":"0.00"}},"06:00:00","00:00:00",{"$f":"IF(I9=\"\",0,IF(OR(I9>=AW9,I9<=AX9),1,IF(OR(J9>=AW9,J9<=AX9),1,IF(AND(I9<=TN9,J9>=AX9,J9<I9),1,0))))","v":0},{"$f":"(J9+$D$6)*24","v":{"v":0,"d":"0.00"}},{"v":24,"d":"24.00"},{"v":0,"d":"0.00"},{"$f":"I9*24","v":{"v":0,"d":"0.00"}},{"$f":"IF(OR(J9=\"\",AY9=0),0,IF(AY9=1,IF(AZ9>BA9,AX9,J9+$D$6)))","v":"00:00:00"},{"$f":"IF(I9=\"\",0,IF(AY9,IF(AND(I9<=AW9,I9>=AX9),AX9,IF(OR(I9>=AW9,I9<=AX9),I9,AW9)),0))","v":"00:00:00"},{"$f":"IF(OR(AY9=0,J9=0),0,IF(J9<=AX9,J9,IF(J9>=AW9,J9,AX9)))","v":"00:00:00"},null,{"$f":"IF(BE9=0,0,IF(BE9<=0.25,BF9-BE9,(BF9+1)-BE9))","v":"00:00:00"},{"$f":"IF(I9=\"\",0,IF(AY9,IF(AND((BC9-$G$6)<=BB9,),BB9,IF(OR((BC9-$G$6)>=BB9),BC9-$G$6,BB9)),0))","v":{"v":0,"d":"0.00"}},{"$f":"BD9*24","v":{"v":0,"d":"0.00"}},{"$f":"I9*24","v":{"v":0,"d":"0.00"}},{"$f":"BF9*24","v":{"v":0,"d":"0.00"}},{"$f":"BJ9-BI9","v":{"v":0,"d":"0.00"}},{"$f":"BL9-BK9","v":{"v":0,"d":"0.00"}},{"$f":"IF(O9=\"\",0,IF($BV$5=\"ja\",O9*24,0))","v":{"v":0,"d":"0.00"}},{"$f":"IF(O9=\"\",0,IF($BV$5=\"nein\",O9*24,0))","v":{"v":0,"d":"0.00"}},{"$f":"IF(C9=0,IF(AH9=0,0,IF(AH9>=0,AH9-BR9,IF(AND(AH9>=0,BV9>=0,$BV$5=\"ja\"),AH9-BV9,IF(AND(AH9>=0,BW9>=0,$BV$5=\"nein\"),AH9-BW9)))),0)","v":{"v":0,"d":"0.00"}},{"$f":"IF(L9=\"\",AM9,AN9)","v":{"v":0,"d":"0.00"}},null,{"$f":"IF(AND(BU3=5,K9>0),IF(S9=1,BM9,BN9),0)","v":{"v":0,"d":"0.00"}},{"$f":"IF(S9=1, AU9,AV9)","v":{"v":0,"d":"0.00"}},{"$f":"IF($BV$5=\"ja\",IF(OR(K9=\"\",C9=\"\"),0,IF(AND(S9=1,K9>0),(K9+$D$6+$D$6)*24,K9*24)),0)","v":{"v":0,"d":"0.00"}},{"$f":"IF($BV$5=\"nein\",IF(OR(K9=\"\",C9=0),0,IF(AND(S9=1,K9>0),(K9+$D$6+$D$6)*24,K9*24)),0)","v":{"v":0,"d":"0.00"}},{"$f":"IF(S9=1,AD9,AE9)","v":{"v":0,"d":"0.00"}}]
[{"$f":"TEXT(B10,\"TTTT\")","v":"Montag"},{"$f":"B9+1","v":"2023-01-02"},{"$f":"'Einsatz 1'!C11","v":""},{"$f":"'Einsatz 1'!D11","v":0},{"$f":"'Einsatz 1'!E11","v":0},{"$f":"'Einsatz 1'!F11","v":0},{"$f":"'Einsatz 1'!G11","v":0},{"$f":"'Einsatz 1'!H11","v":"00:00:00"},null,null,{"$f":"IF(OR(I10=\"\",J10=\"\"),0,MOD(J10-I10,1))","v":"00:00:00"},null,null,{"$f":"IF(K10=\"\",0,IF(L10=\"\",K10+(2*$D$6),K10))","v":"00:00:00"},{"$f":"IF(J10=\"\",0,(IF(L10=\"ja\",ROUNDUP(N10*48,0.5)/48,ROUNDUP(N10*24,0)/24)))","v":"00:00:00"},"21:00:00","06:00:00",{"$f":"IF(I10=\"\",\"\",IF(OR(I10>=P10,I10<=Q10),1,IF(OR(J10>=P10,J10<=Q10),1,IF(AND(I10<=P10,J10>=Q10,J10<I10),1,0))))","v":""},{"$f":"IF(L10=\"\",1,\"\")","v":1},{"$f":"IF(OR(I10=\"\",S10=1),0,IF(R10,IF(AND(I10<=P10,I10>=Q10),P10,IF(OR(I10>=P10,I10<=Q10),I10,P10)),0))","v":"00:00:00"},{"$f":"IF(OR(R10=0,J10=\"\",S10=1),0,IF(J10<=Q10,J10,IF(J10>=P10,J10,Q10)))","v":"00:00:00"},{"$f":"IF(OR(I10=\"\",S10=\"\"),0,IF(R10,IF(AND((I10-$D$6)<=P10,(I10-$D$6)>=Q10),P10,IF(OR((I10-$D$6)>=P10,(I10-$D$6)<=Q10),I10-$D$6,P10)),0))","v":"00:00:00"},{"$f":"IF(OR(J10=\"\",S10=\"\"),0,IF(R10,IF(AND((J10+$D$6)<=P10,(J10+$D$6)>=Q10),Q10,IF(OR((J10+$D$6)<=P10,(J10+$D$6)>=Q10),J10+$D$6,Q10)),0))","v":"00:00:00"},{"$f":"IF(AND(S10=\"\",T10=0),0,IF(W10-V10,(W10+1)-V10,0))","v":"00:00:00"},{"$f":"IF(OR(S10=\"1\",T10=0),0,IF(U10-T10,(U10+1)-T10,0))","v":"00:00:00"},{"$f":"IF(W10=0,0,IF(W10<=23.58,X10*24-24))","v":{"v":0,"d":"0.00"}},{"$f":"IF(W10=0,0,IF(W10>0,X10*24))","v":{"v":0,"d":"0.00"}},{"$f":"IF(U10=0,0,IF(U10<=23.58,Y10*24-24))","v":{"v":0,"d":"0.00"}},{"$f":"IF(U10=0,0,IF(U10>0,Y10*24))","v":{"v":0,"d":"0.00"}},{"$f":"IF(AND(S10=1,Z10<=0,AA10<24),AA10,IF(AA10>0,Z10))","v":{"v":0,"d":"0.00"}},{"$f":"IF(AND(S10=\"\",AB10<=0,AC10<24),AC10,IF(AC10>0,AB10))","v":false},{"$f":"IF(AND(F10=0,J10=0),0,IF(AND(A10=\"Samstag\",S10=1),IF(J10>I10,IF(J10>=0.875,0.875,J10+$D$6)-IF(I10<=(13/24),(13/24),I10-$D$6),IF(I10<=0.875,0.875-I10,0)),0))","v":"00:00:00"},{"$f":"IF(S10=1,0,IF(AND(J10=0,F10=0),0,IF(A10=\"Samstag\",IF(J10>I10,IF(J10>=0.875,0.875,J10)-IF(I10<=(13/24),(13/24),I10),IF(I10<=0.875,0.875-I10,0)),0)))","v":"00:00:00"},{"v":0,"d":"0.00"},{"$f":"IF(AND(A10=\"Samstag\",I10>0,S10=1),0,IF(AND(A10=\"Samstag\",I10>0,S10=\"\"),I10*24,0))","v":{"v":0,"d":"0.00"}},{"v":0,"d":"0.00"},{"$f":"IF(AND(A10=\"Samstag\",J10>0,S10=1),0,IF(AND(A10=\"Samstag\",J10>0,S10=\"\"),J10*24,0))","v":{"v":0,"d":"0.00"}},{"v":0,"d":"0.00"},{"$f":"IF(OR(I10=\"\",L10=\"ja\",AJ10>=21,AND(AJ10<=20,AL10<=20)),0,IF(AND(AJ10<=20,AL10>20,AL10<=21),AL10-20-BV10-BW10,IF(AND(AJ10<=20,AL10>21),21-20-BV10-BW10,IF(AND(AJ10>=20,AJ10<21,AL10>=0,AL10<=12),21-AJ10-BV10-BW10,IF(AND(AJ10<21,OR(AND(AL10>=0,AL10<=21),AND(AL10>=21,AL10<=23.99))),21-20-BV10-BW10)))))","v":{"v":0,"d":"0.00"}},{"$f":"IF(OR(I10=\"\",L10=\"\",AI10>=21,AND(AI10<=20,AK10<=20)),0,IF(AND(AI10<=20,AK10>20,AK10<=21),AK10-20-BV10-BW10,IF(AND(AI10<=20,AK10>21),21-20-BV10-BW10,IF(AND(AI10>=20,AI10<21,AK10>=0,AK10<=12),21-AI10-BV10-BW10,IF(AND(AI10<21,OR(AND(AK10>=0,AK10<=21),AND(AK10>=21,AK10<=23.99))),21-20-BV10-BW10)))))","v":{"v":0,"d":"0.00"}},"00:00:00","00:00:00","00:00:00","00:00:00","00:00:00","00:00:00",{"v":0,"d":"0.00"},{"v":0,"d":"0.00"},"06:00:00","00:00:00",{"$nulls":16},{"v":0,"d":"0.00"},{"v":0,"d":"0.00"},{"$f":"IF(C10=0,IF(AH10=0,0,IF(AH10>=0,AH10-BR10,IF(AND(AH10>=0,BV10>=0,$BV$5=\"ja\"),AH10-BV10,IF(AND(AH10>=0,BW10>=0,$BV$5=\"nein\"),AH10-BW10)))),0)","v":{"v":0,"d":"0.00"}},{"$f":"IF(L10=\"\",AM10,AN10)","v":{"v":0,"d":"0.00"}},null,null,{"v":0,"d":"0.00"},{"v":0,"d":"0.00"},{"$f":"IF($BV$5=\"nein\",IF(OR(K10=\"\",C10=0),0,IF(AND(S10=1,K10>0),(K10+$D$6+$D$6)*24,K10*24)),0)","v":{"v":0,"d":"0.00"}},{"v":0,"d":"0.00"}]
["Dienstag",{"$f":"B10+1","v":"2023-01-03"},{"$f":"'Einsatz 1'!C12","v":""},{"$f":"'Einsatz 1'!D12","v":0},{"$f":"'Einsatz 1'!E12","v":0},{"$f":"'Einsatz 1'!F12","v":0},{"$f":"'Einsatz 1'!G12","v":0},{"$f":"'Einsatz 1'!H12","v":"00:00:00"},null,null,"00:00:00",null,null,"00:00:00","00:00:00","21:00:00","06:00:00","",1,"00:00:00","00:00:00","00:00:00","00:00:00","00:00:00","00:00:00",{"v":0,"d":"0.00"},{"v":0,"d":"0.00"},{"v":0,"d":"0.00"},{"v":0,"d":"0.00"},{"v":0,"d":"0.00"},false,"00:00:00","00:00:00",{"v":0,"d":"0.00"},{"v":0,"d":"0.00"},{"v":0,"d":"0.00"},{"v":0,"d":"0.00"},{"v":0,"d":"0.00"},{"v":0,"d":"0.00"},{"v":0,"d":"0.00"},"00:00:00","00:00:00","00:00:00","00:00:00","00:00:00","00:00:00",{"v":0,"d":"0.00"},{"v":0,"d":"0.00"},"06:00:00","00:00:00",{"$nulls":16},{"v":0,"d":"0.00"},{"v":0,"d":"0.00"},{"v":0,"d":"0.00"},{"v":0,"d":"0.00"},null,null,{"v":0,"d":"0.00"},{"v":0,"d":"0.00"},{"v":0,"d":"0.00"},{"v":0,"d":"0.00"}]
["Mittwoch","2023-01-04",{"$f":"'Einsatz 1'!C13","v":""},{"$f":"'Einsatz 1'!D13","v":0},{"$f":"'Einsatz 1'!E13","v":0},{"$f":"'Einsatz 1'!F13","v":0},{"$f":"'Einsatz 1'!G13","v":0},{"$f":"'Einsatz 1'!H13","v":"00:00:00"},null,null,"00:00:00",null,null,"00:00:00","00:00:00","21:00:00","06:00:00","",1,"00:00:00","00:00:00","00:00:00","00:00:00","00:00:00","00:00:00",{"v":0,"d":"0.00"},{"v":0,"d":"0.00"},{"v":0,"d":"0.00"},{"v":0,"d":"0.00"},{"v":0,"d":"0.00"},false,"00:00:00","00:00:00",{"v":0,"d":"0.00"},{"v":0,"d":"0.00"},{"v":0,"d":"0.00"},{"v":0,"d":"0.00"},{"v":0,"d":"0.00"},{"v":0,"d":"0.00"},{"v":0,"d":"0.00"},"00:00:00","00:00:00","00:00:00","00:00:00","00:00:00","00:00:00",{"v":0,"d":"0.00"},{"v":0,"d":"0.00"},"06:00:00","00:00:00",{"$nulls":16},{"v":0,"d":"0.00"},{"v":0,"d":"0.00"},{"v":0,"d":"0.00"},{"v":0,"d":"0.00"},null,null,{"v":0,"d":"0.00"},{"v":0,"d":"0.00"},{"v":0,"d":"0.00"},{"v":0,"d":"0.00"}]
["Donnerstag","2023-01-05",{"$f":"'Einsatz 1'!C14","v":""},{"$f":"'Einsatz 1'!D14","v":0},{"$f":"'Einsatz 1'!E14","v":0},{"$f":"'Einsatz 1'!F14","v":0},{"$f":"'Einsatz 1'!G14","v":0},{"$f":"'Einsatz 1'!H14","v":"00:00:00"},null,null,"00:00:00",null,null,"00:00:00","00:00:00","21:00:00","06:00:00","",1,"00:00:00","00:00:00","00:00:00","00:00:00","00:00:00","00:00:00",{"v":0,"d":"0.00"},{"v":0,"d":"0.00"},{"v":0,"d":"0.00"},{"v":0,"d":"0.00"},{"v":0,"d":"0.00"},false,"00:00:00","00:00:00",{"v":0,"d":"0.00"},{"v":0,"d":"0.00"},{"v":0,"d":"0.00"},{"v":0,"d":"0.00"},{"v":0,"d":"0.00"},{"v":0,"d":"0.00"},{"v":0,"d":"0.00"},"00:00:00","00:00:00","00:00:00","00:00:00","00:00:00","00:00:00",{"v":0,"d":"0.00"},{"v":0,"d":"0.00"},"06:00:00","00:00:00",{"$nulls":16},{"v":0,"d":"0.00"},{"v":0,"d":"0.00"},{"v":0,"d":"0.00"},{"v":0,"d":"0.00"},null,null,{"v":0,"d":"0.00"},{"v":0,"d":"0.00"},{"v":0,"d":"0.00"},{"v":0,"d":"0.00"}]
["Freitag","2023-01-06",{"$f":"'Einsatz 1'!C15","v":""},{"$f":"'Einsatz 1'!D15","v":0},{"$f":"'Einsatz 1'!E15","v":0},{"$f":"'Einsatz 1'!F15","v":0},{"$f":"'Einsatz 1'!G15","v":0},{"$f":"'Einsatz 1'!H15","v":"00:00:00"},null,null,"00:00:00",null,null,"00:00:00","00:00:00","21:00:00","06:00:00","",1,"00:00:00","00:00:00","00:00:00","00:00:00","00:00:00","00:00:00",{"v":0,"d":"0.00"},{"v":0,"d":"0.00"},{"v":0,"d":"0.00"},{"v":0,"d":"0.00"},{"v":0,"d":"0.00"},false,"00:00:00","00:00:00",{"v":0,"d":"0.00"},{"v":0,"d":"0.00"},{"v":0,"d":"0.00"},{"v":0,"d":"0.00"},{"v":0,"d":"0.00"},{"v":0,"d":"0.00"},{"v":0,"d":"0.00"},"00:00:00","00:00:00","00:00:00","00:00:00","00:00:00","00:00:00",{"v":0,"d":"0.00"},{"v":0,"d":"0.00"},"06:00:00","00:00:00",{"$nulls":16},{"v":0,"d":"0.00"},{"v":0,"d":"0.00"},{"v":0,"d":"0.00"},{"v":0,"d":"0.00"},null,null,{"v":0,"d":"0.00"},{"v":0,"d":"0.00"},{"v":0,"d":"0.00"},{"v":0,"d":"0.00"}]
["Samstag","2023-01-07",{"$f":"'Einsatz 1'!C16","v":""},{"$f":"'Einsatz 1'!D16","v":0},{"$f":"'Einsatz 1'!E16","v":0},{"$f":"'Einsatz 1'!F16","v":0},{"$f":"'Einsatz 1'!G16","v":0},{"$f":"'Einsatz 1'!H16","v":"00:00:00"},null,null,"00:00:00",null,null,"00:00:00","00:00:00","21:00:00","06:00:00","",1,"00:00:00","00:00:00","00:00:00","00:00:00","00:00:00","00:00:00",{"v":0,"d":"0.00"},{"v":0,"d":"0.00"},{"v":0,"d":"0.00"},{"v":0,"d":"0.00"},{"v":0,"d":"0.00"},false,"00:00:00","00:00:00",{"v":0,"d":"0.00"},{"v":0,"d":"0.00"},{"v":0,"d":"0.00"},{"v":0,"d":"0.00"},{"v":0,"d":"0.00"},{"v":0,"d":"0.00"},{"v":0,"d":"0.00"},"00:00:00","00:00:00","00:00:00","00:00:00","00:00:00","00:00:00",{"v":0,"d":"0.00"},{"v":0,"d":"0.00"},"06:00:00","00:00:00",{"$nulls":16},{"v":0,"d":"0.00"},{"v":0,"d":"0.00"},{"v":0,"d":"0.00"},{"v":0,"d":"0.00"},null,null,{"v":0,"d":"0.00"},{"v":0,"d":"0.00"},{"v":0,"d":"0.00"},{"v":0,"d":"0.00"}]
["Sonntag","2023-01-08",{"$f":"'Einsatz 1'!C17","v":""},{"$f":"'Einsatz 1'!D17","v":0},{"$f":"'Einsatz 1'!E17","v":0},{"$f":"'Einsatz 1'!F17","v":0},{"$f":"'Einsatz 1'!G17","v":0},{"$f":"'Einsatz 1'!H17","v":"00:00:00"},null,null,"00:00:00",null,null,"00:00:00","00:00:00","21:00:00","06:00:00","",1,"00:00:00","00:00:00","00:00:00","00:00:00","00:00:00","00:00:00",{"v":0,"d":"0.00"},{"v":0,"d":"0.00"},{"v":0,"d":"0.00"},{"v":0,"d":"0.00"},{"v":0,"d":"0.00"},false,"00:00:00","00:00:00",{"v":0,"d":"0.00"},{"v":0,"d":"0.00"},{"v":0,"d":"0.00"},{"v":0,"d":"0.00"},{"v":0,"d":"0.00"},{"v":0,"d":"0.00"},{"v":0,"d":"0.00"},"00:00:00","00:00:00","00:00:00","00:00:00","00:00:00","00:00:00",{"v":0,"d":"0.00"},{"v":0,"d":"0.00"},"06:00:00","00:00:00",{"$nulls":16},{"v":0,"d":"0.00"},{"v":0,"d":"0.00"},{"v":0,"d":"0.00"},{"v":0,"d":"0.00"},null,null,{"v":0,"d":"0.00"},{"v":0,"d":"0.00"},{"v":0,"d":"0.00"},{"v":0,"d":"0.00"}]
["Montag","2023-01-09",{"$f":"'Einsatz 1'!C18","v":""},{"$f":"'Einsatz 1'!D18","v":0},{"$f":"'Einsatz 1'!E18","v":0},{"$f":"'Einsatz 1'!F18","v":0},{"$f":"'Einsatz 1'!G18","v":0},{"$f":"'Einsatz 1'!H18","v":"00:00:00"},null,null,"00:00:00",null,null,"00:00:00","00:00:00","21:00:00","06:00:00","",1,"00:00:00","00:00:00","00:00:00","00:00:00","00:00:00","00:00:00",{"v":0,"d":"0.00"},{"v":0,"d":"0.00"},{"v":0,"d":"0.00"},{"v":0,"d":"0.00"},{"v":0,"d":"0.00"},false,"00:00:00","00:00:00",{"v":0,"d":"0.00"},{"v":0,"d":"0.00"},{"v":0,"d":"0.00"},{"v":0,"d":"0.00"},{"v":0,"d":"0.00"},{"v":0,"d":"0.00"},{"v":0,"d":"0.00"},"00:00:00","00:00:00","00:00:00","00:00:00","00:00:00","00:00:00",{"v":0,"d":"0.00"},{"v":0,"d":"0.00"},"06:00:00","00:00:00",{"$nulls":16},{"v":0,"d":"0.00"},{"v":0,"d":"0.00"},{"v":0,"d":"0.00"},{"v":0,"d":"0.00"},null,null,{"v":0,"d":"0.00"},{"v":0,"d":"0.00"},{"v":0,"d":"0.00"},{"v":0,"d":"0.00"}]
["Dienstag","2023-01-10",{"$f":"'Einsatz 1'!C19","v":""},{"$f":"'Einsatz 1'!D19","v":0},{"$f":"'Einsatz 1'!E19","v":0},{"$f":"'Einsatz 1'!F19","v":0},{"$f":"'Einsatz 1'!G19","v":0},{"$f":"'Einsatz 1'!H19","v":"00:00:00"},null,null,"00:00:00",null,null,"00:00:00","00:00:00","21:00:00","06:00:00","",1,"00:00:00","00:00:00","00:00:00","00:00:00","00:00:00","00:00:00",{"v":0,"d":"0.00"},{"v":0,"d":"0.00"},{"v":0,"d":"0.00"},{"v":0,"d":"0.00"},{"v":0,"d":"0.00"},false,"00:00:00","00:00:00",{"v":0,"d":"0.00"},{"v":0,"d":"0.00"},{"v":0,"d":"0.00"},{"v":0,"d":"0.00"},{"v":0,"d":"0.00"},{"v":0,"d":"0.00"},{"v":0,"d":"0.00"},"00:00:00","00:00:00","00:00:00","00:00:00","00:00:00","00:00:00",{"v":0,"d":"0.00"},{"v":0,"d":"0.00"},"06:00:00","00:00:00",{"$nulls":16},{"v":0,"d":"0.00"},{"v":0,"d":"0.00"},{"v":0,"d":"0.00"},{"v":0,"d":"0.00"},null,null,{"v":0,"d":"0.00"},{"v":0,"d":"0.00"},{"v":0,"d":"0.00"},{"v":0,"d":"0.00"}]
["Mittwoch","2023-01-11",{"$f":"'Einsatz 1'!C20","v":""},{"$f":"'Einsatz 1'!D20","v":0},{"$f":"'Einsatz 1'!E20","v":0},{"$f":"'Einsatz 1'!F20","v":0},{"$f":"'Einsatz 1'!G20","v":0},{"$f":"'Einsatz 1'!H20","v":"00:00:00"},null,null,"00:00:00",null,null,"00:00:00","00:00:00","21:00:00","06:00:00","",1,"00:00:00","00:00:00","00:00:00","00:00:00","00:00:00","00:00:00",{"v":0,"d":"0.00"},{"v":0,"d":"0.00"},{"v":0,"d":"0.00"},{"v":0,"d":"0.00"},{"v":0,"d":"0.00"},false,"00:00:00","00:00:00",{"v":0,"d":"0.00"},{"v":0,"d":"0.00"},{"v":0,"d":"0.00"},{"v":0,"d":"0.00"},{"v":0,"d":"0.00"},{"v":0,"d":"0.00"},{"v":0,"d":"0.00"},"00:00:00","00:00:00","00:00:00","00:00:00","00:00:00","00:00:00",{"v":0,"d":"0.00"},{"v":0,"d":"0.00"},"06:00:00","00:00:00",{"$nulls":16},{"v":0,"d":"0.00"},{"v":0,"d":"0.00"},{"v":0,"d":"0.00"},{"v":0,"d":"0.00"},null,null,{"v":0,"d":"0.00"},{"v":0,"d":"0.00"},{"v":0,"d":"0.00"},{"v":0,"d":"0.00"}]
["Donnerstag","2023-01-12",{"$f":"'Einsatz 1'!C21","v":""},{"$f":"'Einsatz 1'!D21","v":0},{"$f":"'Einsatz 1'!E21","v":0},{"$f":"'Einsatz 1'!F21","v":0},{"$f":"'Einsatz 1'!G21","v":0},{"$f":"'Einsatz 1'!H21","v":"00:00:00"},null,null,"00:00:00",null,null,"00:00:00","00:00:00","21:00:00","06:00:00","",1,"00:00:00","00:00:00","00:00:00","00:00:00","00:00:00","00:00:00",{"v":0,"d":"0.00"},{"v":0,"d":"0.00"},{"v":0,"d":"0.00"},{"v":0,"d":"0.00"},{"v":0,"d":"0.00"},false,"00:00:00","00:00:00",{"v":0,"d":"0.00"},{"v":0,"d":"0.00"},{"v":0,"d":"0.00"},{"v":0,"d":"0.00"},{"v":0,"d":"0.00"},{"v":0,"d":"0.00"},{"v":0,"d":"0.00"},"00:00:00","00:00:00","00:00:00","00:00:00","00:00:00","00:00:00",{"v":0,"d":"0.00"},{"v":0,"d":"0.00"},"06:00:00","00:00:00",{"$nulls":16},{"v":0,"d":"0.00"},{"v":0,"d":"0.00"},{"v":0,"d":"0.00"},{"v":0,"d":"0.00"},null,null,{"v":0,"d":"0.00"},{"v":0,"d":"0.00"},{"v":0,"d":"0.00"},{"v":0,"d":"0.00"}]
["Freitag","2023-01-13",{"$f":"'Einsatz 1'!C22","v":""},{"$f":"'Einsatz 1'!D22","v":0},{"$f":"'Einsatz 1'!E22","v":0},{"$f":"'Einsatz 1'!F22","v":0},{"$f":"'Einsatz 1'!G22","v":0},{"$f":"'Einsatz 1'!H22","v":"00:00:00"},null,null,"00:00:00",null,null,"00:00:00","00:00:00","21:00:00","06:00:00","",1,"00:00:00","00:00:00","00:00:00","00:00:00","00:00:00","00:00:00",{"v":0,"d":"0.00"},{"v":0,"d":"0.00"},{"v":0,"d":"0.00"},{"v":0,"d":"0.00"},{"v":0,"d":"0.00"},false,"00:00:00","00:00:00",{"v":0,"d":"0.00"},{"v":0,"d":"0.00"},{"v":0,"d":"0.00"},{"v":0,"d":"0.00"},{"v":0,"d":"0.00"},{"v":0,"d":"0.00"},{"v":0,"d":"0.00"},"00:00:00","00:00:00","00:00:00","00:00:00","00:00:00","00:00:00",{"v":0,"d":"0.00"},{"v":0,"d":"0.00"},"06:00:00","00:00:00",{"$nulls":16},{"v":0,"d":"0.00"},{"v":0,"d":"0.00"},{"v":0,"d":"0.00"},{"v":0,"d":"0.00"},null,null,{"v":0,"d":"0.00"},{"v":0,"d":"0.00"},{"v":0,"d":"0.00"},{"v":0,"d":"0.00"}]
["Samstag","2023-01-14",{"$f":"'Einsatz 1'!C23","v":""},{"$f":"'Einsatz 1'!D23","v":0},{"$f":"'Einsatz 1'!E23","v":0},{"$f":"'Einsatz 1'!F23","v":0},{"$f":"'Einsatz 1'!G23","v":0},{"$f":"'Einsatz 1'!H23","v":"00:00:00"},null,null,"00:00:00",null,null,"00:00:00","00:00:00","21:00:00","06:00:00","",1,"00:00:00","00:00:00","00:00:00","00:00:00","00:00:00","00:00:00",{"v":0,"d":"0.00"},{"v":0,"d":"0.00"},{"v":0,"d":"0.00"},{"v":0,"d":"0.00"},{"v":0,"d":"0.00"},false,"00:00:00","00:00:00",{"v":0,"d":"0.00"},{"v":0,"d":"0.00"},{"v":0,"d":"0.00"},{"v":0,"d":"0.00"},{"v":0,"d":"0.00"},{"v":0,"d":"0.00"},{"v":0,"d":"0.00"},"00:00:00","00:00:00","00:00:00","00:00:00","00:00:00","00:00:00",{"v":0,"d":"0.00"},{"v":0,"d":"0.00"},"06:00:00","00:00:00",{"$nulls":16},{"v":0,"d":"0.00"},{"v":0,"d":"0.00"},{"v":0,"d":"0.00"},{"v":0,"d":"0.00"},null,null,{"v":0,"d":"0.00"},{"v":0,"d":"0.00"},{"v":0,"d":"0.00"},{"v":0,"d":"0.00"}]
["Sonntag","2023-01-15",{"$f":"'Einsatz 1'!C24","v":""},{"$f":"'Einsatz 1'!D24","v":0},{"$f":"'Einsatz 1'!E24","v":0},{"$f":"'Einsatz 1'!F24","v":0},{"$f":"'Einsatz 1'!G24","v":0},{"$f":"'Einsatz 1'!H24","v":"00:00:00"},null,null,"00:00:00",null,null,"00:00:00","00:00:00","21:00:00","06:00:00","",1,"00:00:00","00:00:00","00:00:00","00:00:00","00:00:00","00:00:00",{"v":0,"d":"0.00"},{"v":0,"d":"0.00"},{"v":0,"d":"0.00"},{"v":0,"d":"0.00"},{"v":0,"d":"0.00"},false,"00:00:00","00:00:00",{"v":0,"d":"0.00"},{"v":0,"d":"0.00"},{"v":0,"d":"0.00"},{"v":0,"d":"0.00"},{"v":0,"d":"0.00"},{"v":0,"d":"0.00"},{"v":0,"d":"0.00"},"00:00:00","00:00:00","00:00:00","00:00:00","00:00:00","00:00:00",{"v":0,"d":"0.00"},{"v":0,"d":"0.00"},"06:00:00","00:00:00",{"$nulls":16},{"v":0,"d":"0.00"},{"v":0,"d":"0.00"},{"v":0,"d":"0.00"},{"v":0,"d":"0.00"},null,null,{"v":0,"d":"0.00"},{"v":0,"d":"0.00"},{"v":0,"d":"0.00"},{"v":0,"d":"0.00"}]
["Montag","2023-01-16",{"$f":"'Einsatz 1'!C25","v":""},{"$f":"'Einsatz 1'!D25","v":0},{"$f":"'Einsatz 1'!E25","v":0},{"$f":"'Einsatz 1'!F25","v":0},{"$f":"'Einsatz 1'!G25","v":0},{"$f":"'Einsatz 1'!H25","v":"00:00:00"},null,null,"00:00:00",null,null,"00:00:00","00:00:00","21:00:00","06:00:00","",1,"00:00:00","00:00:00","00:00:00","00:00:00","00:00:00","00:00:00",{"v":0,"d":"0.00"},{"v":0,"d":"0.00"},{"v":0,"d":"0.00"},{"v":0,"d":"0.00"},{"v":0,"d":"0.00"},false,"00:00:00","00:00:00",{"v":0,"d":"0.00"},{"v":0,"d":"0.00"},{"v":0,"d":"0.00"},{"v":0,"d":"0.00"},{"v":0,"d":"0.00"},{"v":0,"d":"0.00"},{"v":0,"d":"0.00"},"00:00:00","00:00:00","00:00:00","00:00:00","00:00:00","00:00:00",{"v":0,"d":"0.00"},{"v":0,"d":"0.00"},"06:00:00","00:00:00",{"$nulls":16},{"v":0,"d":"0.00"},{"v":0,"d":"0.00"},{"v":0,"d":"0.00"},{"v":0,"d":"0.00"},null,null,{"v":0,"d":"0.00"},{"v":0,"d":"0.00"},{"v":0,"d":"0.00"},{"v":0,"d":"0.00"}]
["Dienstag","2023-01-17",{"$f":"'Einsatz 1'!C26","v":""},{"$f":"'Einsatz 1'!D26","v":0},{"$f":"'Einsatz 1'!E26","v":0},{"$f":"'Einsatz 1'!F26","v":0},{"$f":"'Einsatz 1'!G26","v":0},{"$f":"'Einsatz 1'!H26","v":"00:00:00"},null,null,"00:00:00",null,null,"00:00:00","00:00:00","21:00:00","06:00:00","",1,"00:00:00","00:00:00","00:00:00","00:00:00","00:00:00","00:00:00",{"v":0,"d":"0.00"},{"v":0,"d":"0.00"},{"v":0,"d":"0.00"},{"v":0,"d":"0.00"},{"v":0,"d":"0.00"},false,"00:00:00","00:00:00",{"v":0,"d":"0.00"},{"v":0,"d":"0.00"},{"v":0,"d":"0.00"},{"v":0,"d":"0.00"},{"v":0,"d":"0.00"},{"v":0,"d":"0.00"},{"v":0,"d":"0.00"},"00:00:00","00:00:00","00:00:00","00:00:00","00:00:00","00:00:00",{"v":0,"d":"0.00"},{"v":0,"d":"0.00"},"06:00:00","00:00:00",{"$nulls":16},{"v":0,"d":"0.00"},{"v":0,"d":"0.00"},{"v":0,"d":"0.00"},{"v":0,"d":"0.00"},null,null,{"v":0,"d":"0.00"},{"v":0,"d":"0.00"},{"v":0,"d":"0.00"},{"v":0,"d":"0.00"}]
["Mittwoch","2023-01-18",{"$f":"'Einsatz 1'!C27","v":""},{"$f":"'Einsatz 1'!D27","v":0},{"$f":"'Einsatz 1'!E27","v":0},{"$f":"'Einsatz 1'!F27","v":0},{"$f":"'Einsatz 1'!G27","v":0},{"$f":"'Einsatz 1'!H27","v":"00:00:00"},null,null,"00:00:00",null,null,"00:00:00","00:00:00","21:00:00","06:00:00","",1,"00:00:00","00:00:00","00:00:00","00:00:00","00:00:00","00:00:00",{"v":0,"d":"0.00"},{"v":0,"d":"0.00"},{"v":0,"d":"0.00"},{"v":0,"d":"0.00"},{"v":0,"d":"0.00"},false,"00:00:00","00:00:00",{"v":0,"d":"0.00"},{"v":0,"d":"0.00"},{"v":0,"d":"0.00"},{"v":0,"d":"0.00"},{"v":0,"d":"0.00"},{"v":0,"d":"0.00"},{"v":0,"d":"0.00"},"00:00:00","00:00:00","00:00:00","00:00:00","00:00:00","00:00:00",{"v":0,"d":"0.00"},{"v":0,"d":"0.00"},"06:00:00","00:00:00",{"$nulls":16},{"v":0,"d":"0.00"},{"v":0,"d":"0.00"},{"v":0,"d":"0.00"},{"v":0,"d":"0.00"},null,null,{"v":0,"d":"0.00"},{"v":0,"d":"0.00"},{"v":0,"d":"0.00"},{"v":0,"d":"0.00"}]
["Donnerstag","2023-01-19",{"$f":"'Einsatz 1'!C28","v":""},{"$f":"'Einsatz 1'!D28","v":0},{"$f":"'Einsatz 1'!E28","v":0},{"$f":"'Einsatz 1'!F28","v":0},{"$f":"'Einsatz 1'!G28","v":0},{"$f":"'Einsatz 1'!H28","v":"00:00:00"},null,null,"00:00:00",null,null,"00:00:00","00:00:00","21:00:00","06:00:00","",1,"00:00:00","00:00:00","00:00:00","00:00:00","00:00:00","00:00:00",{"v":0,"d":"0.00"},{"v":0,"d":"0.00"},{"v":0,"d":"0.00"},{"v":0,"d":"0.00"},{"v":0,"d":"0.00"},false,"00:00:00","00:00:00",{"v":0,"d":"0.00"},{"v":0,"d":"0.00"},{"v":0,"d":"0.00"},{"v":0,"d":"0.00"},{"v":0,"d":"0.00"},{"v":0,"d":"0.00"},{"v":0,"d":"0.00"},"00:00:00","00:00:00","00:00:00","00:00:00","00:00:00","00:00:00",{"v":0,"d":"0.00"},{"v":0,"d":"0.00"},"06:00:00","00:00:00",{"$nulls":16},{"v":0,"d":"0.00"},{"v":0,"d":"0.00"},{"v":0,"d":"0.00"},{"v":0,"d":"0.00"},null,null,{"v":0,"d":"0.00"},{"v":0,"d":"0.00"},{"v":0,"d":"0.00"},{"v":0,"d":"0.00"}]
["Freitag","2023-01-20",{"$f":"'Einsatz 1'!C29","v":""},{"$f":"'Einsatz 1'!D29","v":0},{"$f":"'Einsatz 1'!E29","v":0},{"$f":"'Einsatz 1'!F29","v":0},{"$f":"'Einsatz 1'!G29","v":0},{"$f":"'Einsatz 1'!H29","v":"00:00:00"},null,null,"00:00:00",null,null,"00:00:00","00:00:00","21:00:00","06:00:00","",1,"00:00:00","00:00:00","00:00:00","00:00:00","00:00:00","00:00:00",{"v":0,"d":"0.00"},{"v":0,"d":"0.00"},{"v":0,"d":"0.00"},{"v":0,"d":"0.00"},{"v":0,"d":"0.00"},false,"00:00:00","00:00:00",{"v":0,"d":"0.00"},{"v":0,"d":"0.00"},{"v":0,"d":"0.00"},{"v":0,"d":"0.00"},{"v":0,"d":"0.00"},{"v":0,"d":"0.00"},{"v":0,"d":"0.00"},"00:00:00","00:00:00","00:00:00","00:00:00","00:00:00","00:00:00",{"v":0,"d":"0.00"},{"v":0,"d":"0.00"},"06:00:00","00:00:00",{"$nulls":16},{"v":0,"d":"0.00"},{"v":0,"d":"0.00"},{"v":0,"d":"0.00"},{"v":0,"d":"0.00"},null,null,{"v":0,"d":"0.00"},{"v":0,"d":"0.00"},{"v":0,"d":"0.00"},{"v":0,"d":"0.00"}]
["Samstag","2023-01-21",{"$f":"'Einsatz 1'!C30","v":""},{"$f":"'Einsatz 1'!D30","v":0},{"$f":"'Einsatz 1'!E30","v":0},{"$f":"'Einsatz 1'!F30","v":0},{"$f":"'Einsatz 1'!G30","v":0},{"$f":"'Einsatz 1'!H30","v":"00:00:00"},null,null,"00:00:00",null,null,"00:00:00","00:00:00","21:00:00","06:00:00","",1,"00:00:00","00:00:00","00:00:00","00:00:00","00:00:00","00:00:00",{"v":0,"d":"0.00"},{"v":0,"d":"0.00"},{"v":0,"d":"0.00"},{"v":0,"d":"0.00"},{"v":0,"d":"0.00"},false,"00:00:00","00:00:00",{"v":0,"d":"0.00"},{"v":0,"d":"0.00"},{"v":0,"d":"0.00"},{"v":0,"d":"0.00"},{"v":0,"d":"0.00"},{"v":0,"d":"0.00"},{"v":0,"d":"0.00"},"00:00:00","00:00:00","00:00:00","00:00:00","00:00:00","00:00:00",{"v":0,"d":"0.00"},{"v":0,"d":"0.00"},"06:00:00","00:00:00",{"$nulls":16},{"v":0,"d":"0.00"},{"v":0,"d":"0.00"},{"v":0,"d":"0.00"},{"v":0,"d":"0.00"},null,null,{"v":0,"d":"0.00"},{"$f":"IF($BV$5=\"ja\",IF(OR(K29=\"\",C29=\"\"),0,IF(AND(S29=1,K29>0),(K29+$D$6+$D$6)*24,K29*24)),0)","v":{"v":0,"d":"0.00"}},{"v":0,"d":"0.00"},{"v":0,"d":"0.00"}]
["Sonntag","2023-01-22",{"$f":"'Einsatz 1'!C31","v":""},{"$f":"'Einsatz 1'!D31","v":0},{"$f":"'Einsatz 1'!E31","v":0},{"$f":"'Einsatz 1'!F31","v":0},{"$f":"'Einsatz 1'!G31","v":0},{"$f":"'Einsatz 1'!H31","v":"00:00:00"},null,null,"00:00:00",null,null,"00:00:00","00:00:00","21:00:00","06:00:00","",1,"00:00:00","00:00:00","00:00:00","00:00:00","00:00:00","00:00:00",{"v":0,"d":"0.00"},{"v":0,"d":"0.00"},{"v":0,"d":"0.00"},{"v":0,"d":"0.00"},{"v":0,"d":"0.00"},false,"00:00:00","00:00:00",{"v":0,"d":"0.00"},{"v":0,"d":"0.00"},{"v":0,"d":"0.00"},{"v":0,"d":"0.00"},{"v":0,"d":"0.00"},{"v":0,"d":"0.00"},{"v":0,"d":"0.00"},"00:00:00","00:00:00","00:00:00","00:00:00","00:00:00","00:00:00",{"v":0,"d":"0.00"},{"v":0,"d":"0.00"},"06:00:00","00:00:00",{"$nulls":16},{"v":0,"d":"0.00"},{"v":0,"d":"0.00"},{"v":0,"d":"0.00"},{"v":0,"d":"0.00"},null,null,{"v":0,"d":"0.00"},{"v":0,"d":"0.00"},{"v":0,"d":"0.00"},{"v":0,"d":"0.00"}]
["Montag","2023-01-23",{"$f":"'Einsatz 1'!C32","v":""},{"$f":"'Einsatz 1'!D32","v":0},{"$f":"'Einsatz 1'!E32","v":0},{"$f":"'Einsatz 1'!F32","v":0},{"$f":"'Einsatz 1'!G32","v":0},{"$f":"'Einsatz 1'!H32","v":"00:00:00"},null,null,"00:00:00",null,null,"00:00:00","00:00:00","21:00:00","06:00:00","",1,"00:00:00","00:00:00","00:00:00","00:00:00","00:00:00","00:00:00",{"v":0,"d":"0.00"},{"v":0,"d":"0.00"},{"v":0,"d":"0.00"},{"v":0,"d":"0.00"},{"v":0,"d":"0.00"},false,"00:00:00","00:00:00",{"v":0,"d":"0.00"},{"v":0,"d":"0.00"},{"v":0,"d":"0.00"},{"v":0,"d":"0.00"},{"v":0,"d":"0.00"},{"v":0,"d":"0.00"},{"v":0,"d":"0.00"},"00:00:00","00:00:00","00:00:00","00:00:00","00:00:00","00:00:00",{"v":0,"d":"0.00"},{"v":0,"d":"0.00"},"06:00:00","00:00:00",{"$nulls":16},{"v":0,"d":"0.00"},{"v":0,"d":"0.00"},{"v":0,"d":"0.00"},{"v":0,"d":"0.00"},null,null,{"v":0,"d":"0.00"},{"v":0,"d":"0.00"},{"v":0,"d":"0.00"},{"v":0,"d":"0.00"}]
["Dienstag","2023-01-24",{"$f":"'Einsatz 1'!C33","v":""},{"$f":"'Einsatz 1'!D33","v":0},{"$f":"'Einsatz 1'!E33","v":0},{"$f":"'Einsatz 1'!F33","v":0},{"$f":"'Einsatz 1'!G33","v":0},{"$f":"'Einsatz 1'!H33","v":"00:00:00"},null,null,"00:00:00",null,null,"00:00:00","00:00:00","21:00:00","06:00:00","",1,"00:00:00","00:00:00","00:00:00","00:00:00","00:00:00","00:00:00",{"v":0,"d":"0.00"},{"v":0,"d":"0.00"},{"v":0,"d":"0.00"},{"v":0,"d":"0.00"},{"v":0,"d":"0.00"},false,"00:00:00","00:00:00",{"v":0,"d":"0.00"},{"v":0,"d":"0.00"},{"v":0,"d":"0.00"},{"v":0,"d":"0.00"},{"v":0,"d":"0.00"},{"v":0,"d":"0.00"},{"v":0,"d":"0.00"},"00:00:00","00:00:00","00:00:00","00:00:00","00:00:00","00:00:00",{"v":0,"d":"0.00"},{"v":0,"d":"0.00"},"06:00:00","00:00:00",{"$f":"IF(I32=\"\",0,IF(OR(I32>=AW32,I32<=AX32),1,IF(OR(J32>=AW32,J32<=AX32),1,IF(AND(I32<=TN32,J32>=AX32,J32<I32),1,0))))","v":0},{"$f":"(J32+$D$6)*24","v":{"v":0,"d":"0.00"}},{"v":24,"d":"24.00"},{"v":14,"d":"14.00"},{"$f":"IF(I32=\"\",0,IF(AY32,IF(AND((I32-$D$6)<=AW32,(I32-$D$6)>=AX32),AW32,IF(OR((I32-$D$6)>=AW32,(I32-$D$6)<=AX32),I32-$D$6,AW32)),0))","v":"00:00:00"},{"$f":"IF(OR(J32=\"\",AY32=0),0,IF(AY32=1,IF(AZ32>BA32,AX32,J32+$D$6)))","v":"00:00:00"},{"$f":"IF(I32=\"\",0,IF(AY32,IF(AND(I32<=AW32,I32>=AX32),AW32,IF(OR(I32>=AW32,I32<=AX32),I32,AW32)),0))","v":"00:00:00"},{"$f":"IF(OR(AY32=0,J32=0),0,IF(J32<=AX32,J32,IF(J32>=AW32,J32,AX32)))","v":"00:00:00"},{"$f":"IF(BE32=0,0,IF(BE32<=0.25,BD32-BC32,(BD32+1)-BC32))","v":"00:00:00"},{"$f":"IF(BE32=0,0,IF(BE32<=0.25,BF32-BE32,(BF32+1)-BE32))","v":"00:00:00"},{"$f":"BC32*24","v":{"v":0,"d":"0.00"}},{"$f":"BD32*24","v":{"v":0,"d":"0.00"}},{"$f":"BE32*24","v":{"v":0,"d":"0.00"}},{"$f":"BF32*24","v":{"v":0,"d":"0.00"}},{"$f":"IF(AND(I32>0,$BU$3=12,BI32<=BB32,S33=1),BB32-BI32,0)","v":{"v":0,"d":"0.00"}},{"$f":"IF(AND(I32>0,BJ32>BB32,S32=1),IF(BI32-BB32<0,BG32*24-24-BM32,BI32-BB32),IF(BL32>BB32,BB32-BK32,0))","v":{"v":0,"d":"0.00"}},{"v":0,"d":"0.00"},{"v":0,"d":"0.00"},{"v":0,"d":"0.00"},{"v":0,"d":"0.00"},{"$f":"IF(OR($BU$3<12,I32=\"\"),0,BM32)","v":{"v":0,"d":"0.00"}},{"$f":"IF(AND($BU$3=12,BJ32>14,BJ32<=BA32),BJ32-14,IF(AND($BU$3=12,BL32>14,BL32<=BA32),BL32-14,0))","v":{"v":0,"d":"0.00"}},{"v":0,"d":"0.00"},{"v":0,"d":"0.00"},{"v":0,"d":"0.00"},{"v":0,"d":"0.00"}]
["Mittwoch","2023-01-25",{"$f":"'Einsatz 1'!C34","v":""},{"$f":"'Einsatz 1'!D34","v":0},{"$f":"'Einsatz 1'!E34","v":0},{"$f":"'Einsatz 1'!F34","v":0},{"$f":"'Einsatz 1'!G34","v":0},{"$f":"'Einsatz 1'!H34","v":"00:00:00"},null,null,"00:00:00",null,null,"00:00:00","00:00:00","21:00:00","06:00:00","",1,"00:00:00","00:00:00","00:00:00","00:00:00","00:00:00","00:00:00",{"v":0,"d":"0.00"},{"v":0,"d":"0.00"},{"v":0,"d":"0.00"},{"v":0,"d":"0.00"},{"v":0,"d":"0.00"},false,"00:00:00","00:00:00",{"v":0,"d":"0.00"},{"v":0,"d":"0.00"},{"v":0,"d":"0.00"},{"v":0,"d":"0.00"},{"v":0,"d":"0.00"},{"v":0,"d":"0.00"},{"v":0,"d":"0.00"},"00:00:00","00:00:00","00:00:00","00:00:00","00:00:00","00:00:00",{"v":0,"d":"0.00"},{"v":0,"d":"0.00"},"06:00:00","00:00:00",{"$f":"IF(I33=\"\",0,IF(OR(I33>=AW33,I33<=AX33),1,IF(OR(J33>=AW33,J33<=AX33),1,IF(AND(I33<=TN33,J33>=AX33,J33<I33),1,0))))","v":0},{"$f":"(J33+$D$6)*24","v":{"v":0,"d":"0.00"}},{"v":24,"d":"24.00"},{"v":0,"d":"0.00"},{"$f":"I33*24","v":{"v":0,"d":"0.00"}},{"$f":"IF(OR(J33=\"\",AY33=0),0,IF(AY33=1,IF(AZ33>BA33,AX33,J33+$D$6)))","v":0},{"$f":"IF(I33=\"\",0,IF(AY33,IF(AND(I33<=AW33,I33>=AX33),AX33,IF(OR(I33>=AW33,I33<=AX33),I33,AW33)),0))","v":0},{"$f":"IF(OR(AY33=0,J33=0),0,IF(J33<=AX33,J33,IF(J33>=AW33,J33,AX33)))","v":"00:00:00"},null,{"$f":"IF(BE33=0,0,IF(BE33<=0.25,BF33-BE33,(BF33+1)-BE33))","v":"00:00:00"},{"$f":"IF(I33=\"\",0,IF(AY33,IF(AND((BC33-$G$6)<=BB33,),BB33,IF(OR((BC33-$G$6)>=BB33),BC33-$G$6,BB33)),0))","v":{"v":0,"d":"0.00"}},{"$f":"BD33*24","v":{"v":0,"d":"0.00"}},{"$f":"I33*24","v":{"v":0,"d":"0.00"}},{"$f":"BF33*24","v":{"v":0,"d":"0.00"}},{"$f":"BJ33-BI33","v":{"v":0,"d":"0.00"}},{"$f":"BL33-BK33","v":{"v":0,"d":"0.00"}},{"v":0,"d":"0.00"},{"v":0,"d":"0.00"},{"v":0,"d":"0.00"},{"v":0,"d":"0.00"},null,{"$f":"IF(AND(BU3=12,K33>0),IF(S33=1,BM33,BN33),0)","v":{"v":0,"d":"0.00"}},{"v":0,"d":"0.00"},{"v":0,"d":"0.00"},{"v":0,"d":"0.00"},{"v":0,"d":"0.00"}]
["Donnerstag","2023-01-26",{"$f":"'Einsatz 1'!C35","v":""},{"$f":"'Einsatz 1'!D35","v":0},{"$f":"'Einsatz 1'!E35","v":0},{"$f":"'Einsatz 1'!F35","v":0},{"$f":"'Einsatz 1'!G35","v":0},{"$f":"'Einsatz 1'!H35","v":"00:00:00"},null,null,"00:00:00",null,null,"00:00:00","00:00:00","21:00:00","06:00:00","",1,"00:00:00","00:00:00","00:00:00","00:00:00","00:00:00","00:00:00",{"v":0,"d":"0.00"},{"v":0,"d":"0.00"},{"v":0,"d":"0.00"},{"v":0,"d":"0.00"},{"v":0,"d":"0.00"},false,"00:00:00","00:00:00",{"v":0,"d":"0.00"},{"v":0,"d":"0.00"},{"v":0,"d":"0.00"},{"v":0,"d":"0.00"},{"v":0,"d":"0.00"},{"v":0,"d":"0.00"},{"v":0,"d":"0.00"},"00:00:00","00:00:00","00:00:00","00:00:00","00:00:00","00:00:00",{"v":0,"d":"0.00"},{"v":0,"d":"0.00"},"06:00:00","00:00:00",{"$f":"IF(I34=\"\",0,IF(OR(I34>=AW34,I34<=AX34),1,IF(OR(J34>=AW34,J34<=AX34),1,IF(AND(I34<=TN34,J34>=AX34,J34<I34),1,0))))","v":0},{"$f":"(J34+$D$6)*24","v":{"v":0,"d":"0.00"}},{"v":24,"d":"24.00"},{"v":0,"d":"0.00"},{"$f":"I34*24","v":{"v":0,"d":"0.00"}},{"$f":"IF(OR(J34=\"\",AY34=0),0,IF(AY34=1,IF(AZ34>BA34,AX34,J34+$D$6)))","v":0},{"$f":"IF(I34=\"\",0,IF(AY34,IF(AND(I34<=AW34,I34>=AX34),AX34,IF(OR(I34>=AW34,I34<=AX34),I34,AW34)),0))","v":0},{"$f":"IF(OR(AY34=0,J34=0),0,IF(J34<=AX34,J34,IF(J34>=AW34,J34,AX34)))","v":"00:00:00"},null,{"$f":"IF(BE34=0,0,IF(BE34<=0.25,BF34-BE34,(BF34+1)-BE34))","v":"00:00:00"},{"$f":"IF(I34=\"\",0,IF(AY34,IF(AND((BC34-$G$6)<=BB34,),BB34,IF(OR((BC34-$G$6)>=BB34),BC34-$G$6,BB34)),0))","v":{"v":0,"d":"0.00"}},{"$f":"BD34*24","v":{"v":0,"d":"0.00"}},{"$f":"I34*24","v":{"v":0,"d":"0.00"}},{"$f":"BF34*24","v":{"v":0,"d":"0.00"}},{"$f":"BJ34-BI34","v":{"v":0,"d":"0.00"}},{"$f":"BL34-BK34","v":{"v":0,"d":"0.00"}},{"v":0,"d":"0.00"},{"v":0,"d":"0.00"},{"v":0,"d":"0.00"},{"v":0,"d":"0.00"},null,{"$f":"IF(AND(BU3=12,K34>0),IF(S34=1,BM34,BN34),0)","v":{"v":0,"d":"0.00"}},{"v":0,"d":"0.00"},{"v":0,"d":"0.00"},{"v":0,"d":"0.00"},{"v":0,"d":"0.00"}]
["Freitag","2023-01-27",{"$f":"'Einsatz 1'!C36","v":""},{"$f":"'Einsatz 1'!D36","v":0},{"$f":"'Einsatz 1'!E36","v":0},{"$f":"'Einsatz 1'!F36","v":0},{"$f":"'Einsatz 1'!G36","v":0},{"$f":"'Einsatz 1'!H36","v":"00:00:00"},null,null,"00:00:00",null,null,"00:00:00","00:00:00","21:00:00","06:00:00","",1,"00:00:00","00:00:00","00:00:00","00:00:00","00:00:00","00:00:00",{"v":0,"d":"0.00"},{"v":0,"d":"0.00"},{"v":0,"d":"0.00"},{"v":0,"d":"0.00"},{"v":0,"d":"0.00"},false,"00:00:00","00:00:00",{"v":0,"d":"0.00"},{"v":0,"d":"0.00"},{"v":0,"d":"0.00"},{"v":0,"d":"0.00"},{"v":0,"d":"0.00"},{"v":0,"d":"0.00"},{"v":0,"d":"0.00"},"00:00:00","00:00:00","00:00:00","00:00:00","00:00:00","00:00:00",{"v":0,"d":"0.00"},{"v":0,"d":"0.00"},"06:00:00","00:00:00",{"$nulls":16},{"v":0,"d":"0.00"},{"v":0,"d":"0.00"},{"v":0,"d":"0.00"},{"v":0,"d":"0.00"},null,null,{"v":0,"d":"0.00"},{"v":0,"d":"0.00"},{"v":0,"d":"0.00"},{"v":0,"d":"0.00"}]
["Samstag","2023-01-28",{"$f":"'Einsatz 1'!C37","v":""},{"$f":"'Einsatz 1'!D37","v":0},{"$f":"'Einsatz 1'!E37","v":0},{"$f":"'Einsatz 1'!F37","v":0},{"$f":"'Einsatz 1'!G37","v":0},{"$f":"'Einsatz 1'!H37","v":"00:00:00"},null,null,"00:00:00",null,null,"00:00:00","00:00:00","21:00:00","06:00:00","",1,"00:00:00","00:00:00","00:00:00","00:00:00","00:00:00","00:00:00",{"v":0,"d":"0.00"},{"v":0,"d":"0.00"},{"v":0,"d":"0.00"},{"v":0,"d":"0.00"},{"v":0,"d":"0.00"},false,"00:00:00","00:00:00",{"v":0,"d":"0.00"},{"v":0,"d":"0.00"},{"v":0,"d":"0.00"},{"v":0,"d":"0.00"},{"v":0,"d":"0.00"},{"v":0,"d":"0.00"},{"v":0,"d":"0.00"},"00:00:00","00:00:00","00:00:00","00:00:00","00:00:00","00:00:00",{"v":0,"d":"0.00"},{"v":0,"d":"0.00"},"06:00:00","00:00:00",{"$nulls":16},{"v":0,"d":"0.00"},{"v":0,"d":"0.00"},{"v":0,"d":"0.00"},{"v":0,"d":"0.00"},null,null,{"v":0,"d":"0.00"},{"v":0,"d":"0.00"},{"v":0,"d":"0.00"},{"v":0,"d":"0.00"}]
["Sonntag",{"$f":"IF(MONTH(B36+1)=BU3,B36+1,\"\")","v":"2023-01-29"},{"$f":"'Einsatz 1'!C38","v":""},{"$f":"'Einsatz 1'!D38","v":0},{"$f":"'Einsatz 1'!E38","v":0},{"$f":"'Einsatz 1'!F38","v":0},{"$f":"'Einsatz 1'!G38","v":0},{"$f":"'Einsatz 1'!H38","v":"00:00:00"},null,null,"00:00:00",null,null,"00:00:00","00:00:00","21:00:00","06:00:00","",1,"00:00:00","00:00:00","00:00:00","00:00:00","00:00:00","00:00:00",{"v":0,"d":"0.00"},{"v":0,"d":"0.00"},{"v":0,"d":"0.00"},{"v":0,"d":"0.00"},{"v":0,"d":"0.00"},false,"00:00:00","00:00:00",{"v":0,"d":"0.00"},{"v":0,"d":"0.00"},{"v":0,"d":"0.00"},{"v":0,"d":"0.00"},{"v":0,"d":"0.00"},{"v":0,"d":"0.00"},{"v":0,"d":"0.00"},"00:00:00","00:00:00","00:00:00","00:00:00","00:00:00","00:00:00",{"v":0,"d":"0.00"},{"v":0,"d":"0.00"},"06:00:00","00:00:00",{"$nulls":16},{"v":0,"d":"0.00"},{"v":0,"d":"0.00"},{"v":0,"d":"0.00"},{"v":0,"d":"0.00"},null,null,{"v":0,"d":"0.00"},{"v":0,"d":"0.00"},{"v":0,"d":"0.00"},{"v":0,"d":"0.00"}]
["Montag",{"$f":"IF(MONTH(B36+2)=BU3,B36+2,\"\")","v":"2023-01-30"},{"$f":"'Einsatz 1'!C39","v":""},{"$f":"'Einsatz 1'!D39","v":0},{"$f":"'Einsatz 1'!E39","v":0},{"$f":"'Einsatz 1'!F39","v":0},{"$f":"'Einsatz 1'!G39","v":0},{"$f":"'Einsatz 1'!H39","v":"00:00:00"},null,null,"00:00:00",null,null,"00:00:00","00:00:00","21:00:00","06:00:00","",1,"00:00:00","00:00:00","00:00:00","00:00:00","00:00:00","00:00:00",{"v":0,"d":"0.00"},{"v":0,"d":"0.00"},{"v":0,"d":"0.00"},{"v":0,"d":"0.00"},{"v":0,"d":"0.00"},false,"00:00:00","00:00:00",{"v":0,"d":"0.00"},{"v":0,"d":"0.00"},{"v":0,"d":"0.00"},{"v":0,"d":"0.00"},{"v":0,"d":"0.00"},{"v":0,"d":"0.00"},{"v":0,"d":"0.00"},"00:00:00","00:00:00","00:00:00","00:00:00","00:00:00","00:00:00",{"v":0,"d":"0.00"},{"v":0,"d":"0.00"},"06:00:00","00:00:00",{"$nulls":16},{"v":0,"d":"0.00"},{"v":0,"d":"0.00"},{"v":0,"d":"0.00"},{"v":0,"d":"0.00"},null,null,{"v":0,"d":"0.00"},{"v":0,"d":"0.00"},{"v":0,"d":"0.00"},{"v":0,"d":"0.00"}]
["Dienstag",{"$f":"IF(MONTH(B36+3)=BU3,B36+3,\"\")","v":"2023-01-31"},{"$f":"'Einsatz 1'!C40","v":""},{"$f":"'Einsatz 1'!D40","v":0},{"$f":"'Einsatz 1'!E40","v":0},{"$f":"'Einsatz 1'!F40","v":0},{"$f":"'Einsatz 1'!G40","v":0},{"$f":"'Einsatz 1'!H40","v":"00:00:00"},null,null,"00:00:00",null,null,"00:00:00","00:00:00","21:00:00","06:00:00","",1,"00:00:00","00:00:00","00:00:00","00:00:00","00:00:00","00:00:00",{"v":0,"d":"0.00"},{"v":0,"d":"0.00"},{"v":0,"d":"0.00"},{"v":0,"d":"0.00"},{"v":0,"d":"0.00"},false,"00:00:00","00:00:00",{"v":0,"d":"0.00"},{"v":0,"d":"0.00"},{"v":0,"d":"0.00"},{"v":0,"d":"0.00"},{"v":0,"d":"0.00"},{"v":0,"d":"0.00"},{"v":0,"d":"0.00"},"00:00:00","00:00:00","00:00:00","00:00:00","00:00:00","00:00:00",{"v":0,"d":"0.00"},{"v":0,"d":"0.00"},"06:00:00","00:00:00",{"$f":"IF(I39=\"\",0,IF(OR(I39>=AW39,I39<=AX39),1,IF(OR(J39>=AW39,J39<=AX39),1,IF(AND(I39<=TN39,J39>=AX39,J39<I39),1,0))))","v":0},{"$f":"(J39+$D$6)*24","v":{"v":0,"d":"0.00"}},{"v":24,"d":"24.00"},{"v":14,"d":"14.00"},{"$f":"IF(I39=\"\",0,IF(AY39,IF(AND((I39-$D$6)<=AW39,(I39-$D$6)>=AX39),AW39,IF(OR((I39-$D$6)>=AW39,(I39-$D$6)<=AX39),I39-$D$6,AW39)),0))","v":"00:00:00"},{"$f":"IF(OR(J39=\"\",AY39=0),0,IF(AY39=1,IF(AZ39>BA39,AX39,J39+$D$6)))","v":"00:00:00"},{"$f":"IF(I39=\"\",0,IF(AY39,IF(AND(I39<=AW39,I39>=AX39),AW39,IF(OR(I39>=AW39,I39<=AX39),I39,AW39)),0))","v":"00:00:00"},{"$f":"IF(OR(AY39=0,J39=0),0,IF(J39<=AX39,J39,IF(J39>=AW39,J39,AX39)))","v":"00:00:00"},{"$f":"IF(BE39=0,0,IF(BE39<=0.25,BD39-BC39,(BD39+1)-BC39))","v":"00:00:00"},{"$f":"IF(BE39=0,0,IF(BE39<=0.25,BF39-BE39,(BF39+1)-BE39))","v":"00:00:00"},{"$f":"BC39*24","v":{"v":0,"d":"0.00"}},{"$f":"BD39*24","v":{"v":0,"d":"0.00"}},{"$f":"BE39*24","v":{"v":0,"d":"0.00"}},{"$f":"BF39*24","v":{"v":0,"d":"0.00"}},{"$f":"IF(AND(I39>0,$BU$3=12,BI39<=BB39,S39=1),BJ39-BI39,0)","v":{"v":0,"d":"0.00"}},{"$f":"IF(AND(I39>0,BJ39>BB39,S39=1),IF(BI39-BB39<0,BG39*24-24-BM39,BI39-BB39),IF(BL39>BB39,BB39-BK39,0))","v":{"v":0,"d":"0.00"}},{"v":0,"d":"0.00"},{"v":0,"d":"0.00"},{"v":0,"d":"0.00"},{"v":0,"d":"0.00"},{"$f":"IF(OR($BU$3<12,I39=\"\"),0,BM39)","v":{"v":0,"d":"0.00"}},{"$f":"IF(AND($BU$3=12,BJ39<BB39,BJ39<=BA39),SUM(BJ39-IF(BI39-BB39>=0,BB39,BI39)),IF(AND($BU$3=12,BL39>14,BL39<=BA39),SUM(IF(BL39-14>0,BL39,14),0)))","v":false},{"v":0,"d":"0.00"},{"v":0,"d":"0.00"},{"v":0,"d":"0.00"},{"v":0,"d":"0.00"}]
[{"$nulls":10},{"$f":"SUM(K9:K39)","v":"00:00:00"},{"$nulls":55},{"$f":"SUM(BO9:BO39)","v":{"v":0,"d":"0.00"}},{"$f":"SUM(BP9:BP39)","v":{"v":0,"d":"0.00"}},{"v":0,"d":"0.00"},{"v":0,"d":"0.00"},{"v":0,"d":"0.00"},{"v":0,"d":"0.00"},{"v":0,"d":"0.00"},{"v":0,"d":"0.00"},{"v":0,"d":"0.00"},{"v":0,"d":"0.00"}]
[{"$nulls":3},{"$f":"'Einsatz 1'!D42","v":""},{"$f":"'Einsatz 1'!E42","v":""},{"$f":"'Einsatz 1'!F42","v":""},{"$f":"'Einsatz 1'!G42","v":""},{"$f":"'Einsatz 1'!H42","v":""},{"$nulls":58},{"$f":"IF(BO40=0,\"\",IF(BO40>0,SUM(BO9:BO39),\"\"))","v":""},{"$f":"IF(BP40=0,\"\",IF(BP40>0,SUM(BP9:BP39),\"\"))","v":""},{"$f":"IF(BQ40=0,\"\",IF(BQ40>0,SUM(BQ9:BQ39),\"\"))","v":""},{"$f":"IF(BR40=0,\"\",IF(BR40>0,SUM(BR9:BR39),\"\"))","v":""},{"$f":"IF(BS40=0,\"\",IF(BS40>0,SUM(BS9:BS39),\"\"))","v":""},"","","","",""]
[null,null,"* Es gelten nur die gesetzlichen Feiertage. Weihnachten und 1. Mai sind unter Lohnart 5071 gesondert berücksichtigt."]
[null,null,"** Auszuwählen ist an jedem Urlaubs- und/oder Krankheitstag jeweils \"ja\". "]
[null,null,"*** Auszuwählen ist \"ja\" nur an dem Tag, an dem die Rufbereitschaft begann."]
[null,null,"**** Bei Einsätzen, für die eine Vor-Ort-Anwensenheit nicht erforderlich war, bitte auf \"ja\" klicken. In diesem Fall wird bei der Berechnung keine Wegezeit berücksichtigt. ",{"$nulls":70},{"$f":"'Einsatz 1'!BV46","v":"Stand des Formulars: 01.02.2023"}]

{"sheet":"Einsatz 3","index":2,"n_rows":45,"n_cols":76,"rows_kept":45,"merged":[[4,11,4,12]]}
["Nachweis über Überstunden, Überstundenvergütung und Zeitzuschläge ",{"$nulls":72},"Datum:",{"$f":"TODAY()","v":"2023-02-01"}]
[]
[null,null,"3. Einsatz",{"$nulls":5},"Rufbereitschaft und Zeitzuschläge",{"$nulls":62},"Monat:",{"$f":"'Einsatz 1'!BU3","v":1},"Jahr:",{"$f":"'Einsatz 1'!BW3","v":2023}]
[]
[null,null,"Name, Vorname:",{"$f":"'Einsatz 1'!D5","v":0},{"$nulls":6},"Orga-Einheit:",{"$f":"'Einsatz 1'!L5","v":"Dezernat 5.3"},{"$nulls":60},"Freizeitausgleich wird gewährt:",{"$f":"'Einsatz 1'!BV5","v":"ja"}]
[null,null,"Übliche Wegezeit (h:mm):",{"$f":"'Einsatz 1'!D6","v":"00:00:00"},null,"Industriestunden:",{"$f":"D6*24","v":{"v":0,"d":"0.00"}}]
["Tag","Datum","gesetzl. Feiertag in NRW*","Urlaub**","Krankheit (AU)**","Rufbereitschaft Mo-Fr 15:15 bis 07:00 des Folgetags***","Rufbereitschaft Sa, So, Feiertag (07:00 bis 07:00 des Folgetags)***","Rufbereitschaft       weniger als 12 Std.              (hh:mm)","Uhrzeit Einsatz von (hh:mm)","Uhrzeit Einsatz bis (hh:mm)","Arbeitszeit des Einsatzes (ohne Wegezeit)","Der Einsatz erfolgte ohne Präsenz (z.B. telefonisch)****","Grund des Einsatzes","AZ (ggf. mit WZ)","AZ (ggf. ,mit WZ) gerundet","Beginn Nacht-arbeits-zeit-rahmen","Ende Nacht-arbeits-zeit-rahmen","Nacht-einsatz? \n1-Ja ","Wegezeit 1-ja","Beginn Nacht-einsatz (ohne WZ)","Ende Nacht-einsatz (ohne WZ)","Beginn Nacht-einsatz (mit WZ)","Ende Nachtarbeit (mit WZ)","Nachtarbeit mit WZ","Nachtarbeit ohne WZ","Ende Nacht-einsatz (mit WZ) vor 0","Ende Nacht-einsatz (mit WZ) nach 0","Ende Nacht-einsatz (o WZ) vor 0","Ende Nacht-einsatz (o WZ) nach 0","Summe Nacht-einsatz (mit WZ)","Summe Nacht-einsatz (o WZ)","Samstagsarbeit 13-21 Uhr (mit WZ)","Samstagsarbeit 13-21 Uhr (o WZ)","Samstagsarbeit, wenn negative Zeiten","Beginn Samstags-arbeit o WZ","Beginn Samstags-arbeit m WZ","Ende Samstags-arbeit o WZ","Ende Samstags-arbeit m WZ","Samstagsarbeit 20-21 m WZ","Samstagsarbeit 20-21 o WZ","Beginn Sonntagsarbeit mit WZ","Ende Sonntagsarbeit mit WZ","Beginn Sonntagsarbeit o WZ","Ende Sonntagsarbeit o WZ","Sonntagsarbeit mit WZ","Sonntagsarbeit o WZ","Sonntagsarbeit mit WZ (dezimal)","Sonntagsarbeit o WZ (dezimal)","Beginn Rahmen 24. & 31.12.","Ende Rahmen 24. & 31.12.","Arbeit 24. & 31.12.","Arbeit 24. & 31.12. Ende nach 0 Uhr","Arbeit am 24. & 31.12. (24 h)","Arbeit am 24. & 31.12. (14 h)","Beginn 24.12. & 31.12. (mit WZ)","Ende 24.12. & 31.12. (mit WZ)","Beginn 24.12. & 31.12. (o WZ)","Ende 24.12. & 31.12. (o WZ)","Arbeit 24.12. & 31.12. (mit WZ)","Arbeit 24.12. & 31.12. (o WZ)","Beginn 24.12. & 31.12. (mit WZ)","Ende 24.12. & 31.12. bis 14 Uhr (mit WZ)","Beginn 24.12. & 31.12. (o WZ)","Ende 24.12. & 31.12. bis 14 Uhr (o WZ)","Ende 24. & 31.12. vor 14 Uhr BB32, BC32 dezimal)","Ende 24. & 31.12. nach 14 Uhr","Stunden mit Freizeitausgleich","Stunden ohne Freizeitausgleich","Arbeit am Samstag           13-20 Uhr","Arbeit am Samstag          20-21 Uhr","Arbeit am 24.12.& 31.12. \n 6-14 Uhr","Arbeit am 24.12. 14-24 Uhr; am 25./26.12.           & am 01.05. ","Arbeit am Sonntag","Arbeit am Feiertag mit Freizeitausgleich","Arbeit am Feiertag ohne Freizeitausgleich","Nachtarbeit                 (21-6 Uhr)"]
[{"$nulls":3},5167,5168,5200,5201,5204,{"$nulls":58},5012,"5012 und 5014",5080,5083,5070,5071,5050,5061,"5060 und 5061",5040]
[{"$f":"TEXT(B9,\"TTTT\")","v":"Sonntag"},{"$f":"DATE(BW3,BU3,1)","v":"2023-01-01"},{"$f":"'Einsatz 1'!C10","v":"Neujahr"},{"$f":"'Einsatz 1'!D10","v":0},{"$f":"'Einsatz 1'!E10","v":0},{"$f":"'Einsatz 1'!F10","v":0},{"$f":"'Einsatz 1'!G10","v":0},{"$f":"'Einsatz 1'!H10","v":"00:00:00"},null,null,{"$f":"IF(OR(I9=\"\",J9=\"\"),0,MOD(J9-I9,1))","v":"00:00:00"},null,null,{"$f":"IF(K9=\"\",0,IF(L9=\"\",K9+(2*$D$6),K9))","v":"00:00:00"},{"$f":"IF(J9=\"\",0,(IF(L9=\"ja\",ROUNDUP(N9*48,0.5)/48,ROUNDUP(N9*24,0)/24)))","v":"00:00:00"},"21:00:00","06:00:00",{"$f":"IF(I9=\"\",0,IF(OR(I9>=P9,I9<=Q9),1,IF(OR(J9>=P9,J9<=Q9),1,IF(AND(I9<=P9,J9>=Q9,J9<I9),1,0))))","v":0},{"$f":"IF(L9=\"\",1,\"\")","v":1},{"$f":"IF(OR(I9=\"\",S9=1),0,IF(R9,IF(AND(I9<=P9,I9>=Q9),P9,IF(OR(I9>=P9,I9<=Q9),I9,P9)),0))","v":"00:00:00"},{"$f":"IF(OR(R9=0,J9=\"\",S9=1),0,IF(J9<=Q9,J9,IF(J9>=P9,J9,Q9)))","v":"00:00:00"},{"$f":"IF(OR(I9=\"\",S9=\"\"),0,IF(R9,IF(AND((I9-$D$6)<=P9,(I9-$D$6)>=Q9),P9,IF(OR((I9-$D$6)>=P9,(I9-$D$6)<=Q9),I9-$D$6,P9)),0))","v":"00:00:00"},{"$f":"IF(OR(J9=\"\",S9=\"\"),0,IF(R9,IF(AND((J9+$D$6)<=P9,(J9+$D$6)>=Q9),Q9,IF(OR((J9+$D$6)<=P9,(J9+$D$6)>=Q9),J9+$D$6,Q9)),0))","v":"00:00:00"},{"$f":"IF(AND(S9=\"\",T9=0),0,IF(W9-V9,(W9+1)-V9,0))","v":"00:00:00"},{"$f":"IF(OR(S9=\"1\",T9=0),0,IF(U9-T9,(U9+1)-T9,0))","v":"00:00:00"},{"$f":"IF(W9=0,0,IF(W9<=23.58,X9*24-24))","v":{"v":0,"d":"0.00"}},{"$f":"IF(W9=0,0,IF(W9>0,X9*24))","v":{"v":0,"d":"0.00"}},{"$f":"IF(U9=0,0,IF(U9<=23.58,Y9*24-24))","v":{"v":0,"d":"0.00"}},{"$f":"IF(U9=0,0,IF(U9>0,Y9*24))","v":{"v":0,"d":"0.00"}},{"$f":"IF(AND(S9=1,Z9<=0,AA9<24),AA9,IF(AA9>0,Z9))","v":{"v":0,"d":"0.00"}},{"$f":"IF(AND(S9=\"\",AB9<=0,AC9<24),AC9,IF(AC9>0,AB9))","v":false},{"$f":"IF(AND(F9=0,J9=0),0,IF(AND(A9=\"Samstag\",S9=1),IF(J9>I9,IF(J9>=0.875,0.875,J9+$D$6)-IF(I9<=(13/24),(13/24),I9-$D$6),IF(I9<=0.875,0.875-I9,0)),0))","v":"00:00:00"},{"$f":"IF(S9=1,0,IF(AND(J9=0,F9=0),0,IF(A9=\"Samstag\",IF(J9>I9,IF(J9>=0.875,0.875,J9)-IF(I9<=(13/24),(13/24),I9),IF(I9<=0.875,0.875-I9,0)),0)))","v":"00:00:00"},{"$f":"IF(AG9>0,AG9*24,AF9*24)","v":{"v":0,"d":"0.00"}},{"$f":"IF(AND(A9=\"Samstag\",I9>0,S9=1),0,IF(AND(A9=\"Samstag\",I9>0,S9=\"\"),I9*24,0))","v":{"v":0,"d":"0.00"}},{"$f":"IF(AND(A9=\"Samstag\",I9>0,S9=1),(I9-$D$6)*24,IF(AND(A9=\"Samstag\",I9>0),I9*24,0))","v":{"v":0,"d":"0.00"}},{"$f":"IF(AND(A9=\"Samstag\",J9>0,S9=1),0,IF(AND(A9=\"Samstag\",J9>0,S9=\"\"),J9*24,0))","v":{"v":0,"d":"0.00"}},{"$f":"IF(AND(A9=\"Samstag\",J9>0,S9=1),(J9+$D$6)*24,0)","v":{"v":0,"d":"0.00"}},{"$f":"IF(OR(I9=\"\",L9=\"ja\",AJ9>=21,AND(AJ9<=20,AL9<=20)),0,IF(AND(AJ9<=20,AL9>20,AL9<=21),AL9-20-BV9-BW9,IF(AND(AJ9<=20,AL9>21),21-20-BV9-BW9,IF(AND(AJ9>=20,AJ9<21,AL9>=0,AL9<=12),21-AJ9-BV9-BW9,IF(AND(AJ9<21,OR(AND(AL9>=0,AL9<=21),AND(AL9>=21,AL9<=23.99))),21-20-BV9-BW9)))))","v":{"v":0,"d":"0.00"}},{"$f":"IF(OR(I9=\"\",L9=\"\",AI9>=21,AND(AI9<=20,AK9<=20)),0,IF(AND(AI9<=20,AK9>20,AK9<=21),AK9-20-BV9-BW9,IF(AND(AI9<=20,AK9>21),21-20-BV9-BW9,IF(AND(AI9>=20,AI9<21,AK9>=0,AK9<=12),21-AI9-BV9-BW9,IF(AND(AI9<21,OR(AND(AK9>=0,AK9<=21),AND(AK9>=21,AK9<=23.99))),21-20-BV9-BW9)))))","v":{"v":0,"d":"0.00"}},{"$f":"IF(A9=\"Sonntag\",I9-$D$6,IF(A9=\"Samstag\",IF(J9<I9,0,0),0))","v":"00:00:00"},{"$f":"IF(J9=\"\",0,IF(A9=\"Sonntag\",IF((J9+$D$6)<I9,1,J9+$D$6),IF(A9=\"Samstag\",IF((J9+$D$6)<I9,J9+$D$6,0),0)))","v":"00:00:00"},{"$f":"IF(A9=\"Sonntag\",I9,IF(A9=\"Samstag\",IF(J9<I9,0,0),0))","v":"00:00:00"},{"$f":"IF(A9=\"Sonntag\",IF(J9<I9,1,J9),IF(A9=\"Samstag\",IF(J9<I9,J9,0),0))","v":"00:00:00"},{"$f":"IF(J9=\"\",0,IF(AND(AO9=0,AP9=0),0,IF(OR(A9=\"Sonntag\",A9=\"Samstag\"),AP9-AO9,0)))","v":"00:00:00"},{"$f":"IF(AND(AQ9=0,AR9=0),0,IF(OR(A9=\"Sonntag\",A9=\"Samstag\"),AR9-AQ9,0))","v":"00:00:00"},{"$f":"IF(OR(AS9=0,AS9=\"\"),0,IF(AND(AS9>0,BV9>=0,$BV$5=\"ja\"),AS9*24-BV9,IF(AND(AS9>0,BV9>=0,$BV$5=\"nein\"),AS9*24-BW9)))","v":{"v":0,"d":"0.00"}},{"$f":"IF(OR(AT9=0,AT9=\"\"),0,IF(AND(AT9>0,BV9>=0,$BV$5=\"ja\"),AT9*24-BV9,IF(AND(AT9>0,BV9>=0,$BV$5=\"nein\"),AT9*24-BW9)))","v":{"v":0,"d":"0.00"}},"06:00:00","00:00:00",{"$f":"IF(I9=\"\",0,IF(OR(I9>=AW9,I9<=AX9),1,IF(OR(J9>=AW9,J9<=AX9),1,IF(AND(I9<=TN9,J9>=AX9,J9<I9),1,0))))","v":0},{"$f":"(J9+$D$6)*24","v":{"v":0,"d":"0.00"}},{"v":24,"d":"24.00"},{"v":0,"d":"0.00"},{"$f":"I9*24","v":{"v":0,"d":"0.00"}},{"$f":"IF(OR(J9=\"\",AY9=0),0,IF(AY9=1,IF(AZ9>BA9,AX9,J9+$D$6)))","v":"00:00:00"},{"$f":"IF(I9=\"\",0,IF(AY9,IF(AND(I9<=AW9,I9>=AX9),AX9,IF(OR(I9>=AW9,I9<=AX9),I9,AW9)),0))","v":"00:00:00"},{"$f":"IF(OR(AY9=0,J9=0),0,IF(J9<=AX9,J9,IF(J9>=AW9,J9,AX9)))","v":"00:00:00"},null,{"$f":"IF(BE9=0,0,IF(BE9<=0.25,BF9-BE9,(BF9+1)-BE9))","v":"00:00:00"},{"$f":"IF(I9=\"\",0,IF(AY9,IF(AND((BC9-$G$6)<=BB9,),BB9,IF(OR((BC9-$G$6)>=BB9),BC9-$G$6,BB9)),0))","v":{"v":0,"d":"0.00"}},{"$f":"BD9*24","v":{"v":0,"d":"0.00"}},{"$f":"I9*24","v":{"v":0,"d":"0.00"}},{"$f":"BF9*24","v":{"v":0,"d":"0.00"}},{"$f":"BJ9-BI9","v":{"v":0,"d":"0.00"}},{"$f":"BL9-BK9","v":{"v":0,"d":"0.00"}},{"$f":"IF(O9=\"\",0,IF($BV$5=\"ja\",O9*24,0))","v":{"v":0,"d":"0.00"}},{"$f":"IF(O9=\"\",0,IF($BV$5=\"nein\",O9*24,0))","v":{"v":0,"d":"0.00"}},{"$f":"IF(C9=0,IF(AH9=0,0,IF(AH9>=0,AH9-BR9,IF(AND(AH9>=0,BV9>=0,$BV$5=\"ja\"),AH9-BV9,IF(AND(AH9>=0,BW9>=0,$BV$5=\"nein\"),AH9-BW9)))),0)","v":{"v":0,"d":"0.00"}},{"$f":"IF(L9=\"\",AM9,AN9)","v":{"v":0,"d":"0.00"}},null,{"$f":"IF(AND(BU3=5,K9>0),IF(S9=1,BM9,BN9),0)","v":{"v":0,"d":"0.00"}},{"$f":"IF(S9=1, AU9,AV9)","v":{"v":0,"d":"0.00"}},{"$f":"IF($BV$5=\"ja\",IF(OR(K9=\"\",C9=\"\"),0,IF(AND(S9=1,K9>0),(K9+$D$6+$D$6)*24,K9*24)),0)","v":{"v":0,"d":"0.00"}},{"$f":"IF($BV$5=\"nein\",IF(OR(K9=\"\",C9=0),0,IF(AND(S9=1,K9>0),(K9+$D$6+$D$6)*24,K9*24)),0)","v":{"v":0,"d":"0.00"}},{"$f":"IF(S9=1,AD9,AE9)","v":{"v":0,"d":"0.00"}}]
[{"$f":"TEXT(B10,\"TTTT\")","v":"Montag"},{"$f":"B9+1","v":"2023-01-02"},{"$f":"'Einsatz 1'!C11","v":""},{"$f":"'Einsatz 1'!D11","v":0},{"$f":"'Einsatz 1'!E11","v":0},{"$f":"'Einsatz 1'!F11","v":0},{"$f":"'Einsatz 1'!G11","v":0},{"$f":"'Einsatz 1'!H11","v":"00:00:00"},null,null,{"$f":"IF(OR(I10=\"\",J10=\"\"),0,MOD(J10-I10,1))","v":"00:00:00"},null,null,{"$f":"IF(K10=\"\",0,IF(L10=\"\",K10+(2*$D$6),K10))","v":"00:00:00"},{"$f":"IF(J10=\"\",0,(IF(L10=\"ja\",ROUNDUP(N10*48,0.5)/48,ROUNDUP(N10*24,0)/24)))","v":"00:00:00"},"21:00:00","06:00:00",{"$f":"IF(I10=\"\",\"\",IF(OR(I10>=P10,I10<=Q10),1,IF(OR(J10>=P10,J10<=Q10),1,IF(AND(I10<=P10,J10>=Q10,J10<I10),1,0))))","v":""},{"$f":"IF(L10=\"\",1,\"\")","v":1},{"$f":"IF(OR(I10=\"\",S10=1),0,IF(R10,IF(AND(I10<=P10,I10>=Q10),P10,IF(OR(I10>=P10,I10<=Q10),I10,P10)),0))","v":"00:00:00"},{"$f":"IF(OR(R10=0,J10=\"\",S10=1),0,IF(J10<=Q10,J10,IF(J10>=P10,J10,Q10)))","v":"00:00:00"},{"$f":"IF(OR(I10=\"\",S10=\"\"),0,IF(R10,IF(AND((I10-$D$6)<=P10,(I10-$D$6)>=Q10),P10,IF(OR((I10-$D$6)>=P10,(I10-$D$6)<=Q10),I10-$D$6,P10)),0))","v":"00:00:00"},{"$f":"IF(OR(J10=\"\",S10=\"\"),0,IF(R10,IF(AND((J10+$D$6)<=P10,(J10+$D$6)>=Q10),Q10,IF(OR((J10+$D$6)<=P10,(J10+$D$6)>=Q10),J10+$D$6,Q10)),0))","v":"00:00:00"},{"$f":"IF(AND(S10=\"\",T10=0),0,IF(W10-V10,(W10+1)-V10,0))","v":"00:00:00"},{"$f":"IF(OR(S10=\"1\",T10=0),0,IF(U10-T10,(U10+1)-T10,0))","v":"00:00:00"},{"$f":"IF(W10=0,0,IF(W10<=23.58,X10*24-24))","v":{"v":0,"d":"0.00"}},{"$f":"IF(W10=0,0,IF(W10>0,X10*24))","v":{"v":0,"d":"0.00"}},{"$f":"IF(U10=0,0,IF(U10<=23.58,Y10*24-24))","v":{"v":0,"d":"0.00"}},{"$f":"IF(U10=0,0,IF(U10>0,Y10*24))","v":{"v":0,"d":"0.00"}},{"$f":"IF(AND(S10=1,Z10<=0,AA10<24),AA10,IF(AA10>0,Z10))","v":{"v":0,"d":"0.00"}},{"$f":"IF(AND(S10=\"\",AB10<=0,AC10<24),AC10,IF(AC10>0,AB10))","v":false},{"$f":"IF(AND(F10=0,J10=0),0,IF(AND(A10=\"Samstag\",S10=1),IF(J10>I10,IF(J10>=0.875,0.875,J10+$D$6)-IF(I10<=(13/24),(13/24),I10-$D$6),IF(I10<=0.875,0.875-I10,0)),0))","v":"00:00:00"},{"$f":"IF(S10=1,0,IF(AND(J10=0,F10=0),0,IF(A10=\"Samstag\",IF(J10>I10,IF(J10>=0.875,0.875,J10)-IF(I10<=(13/24),(13/24),I10),IF(I10<=0.875,0.875-I10,0)),0)))","v":"00:00:00"},{"v":0,"d":"0.00"},{"$f":"IF(AND(A10=\"Samstag\",I10>0,S10=1),0,IF(AND(A10=\"Samstag\",I10>0,S10=\"\"),I10*24,0))","v":{"v":0,"d":"0.00"}},{"v":0,"d":"0.00"},{"$f":"IF(AND(A10=\"Samstag\",J10>0,S10=1),0,IF(AND(A10=\"Samstag\",J10>0,S10=\"\"),J10*24,0))","v":{"v":0,"d":"0.00"}},{"v":0,"d":"0.00"},{"$f":"IF(OR(I10=\"\",L10=\"ja\",AJ10>=21,AND(AJ10<=20,AL10<=20)),0,IF(AND(AJ10<=20,AL10>20,AL10<=21),AL10-20-BV10-BW10,IF(AND(AJ10<=20,AL10>21),21-20-BV10-BW10,IF(AND(AJ10>=20,AJ10<21,AL10>=0,AL10<=12),21-AJ10-BV10-BW10,IF(AND(AJ10<21,OR(AND(AL10>=0,AL10<=21),AND(AL10>=21,AL10<=23.99))),21-20-BV10-BW10)))))","v":{"v":0,"d":"0.00"}},{"$f":"IF(OR(I10=\"\",L10=\"\",AI10>=21,AND(AI10<=20,AK10<=20)),0,IF(AND(AI10<=20,AK10>20,AK10<=21),AK10-20-BV10-BW10,IF(AND(AI10<=20,AK10>21),21-20-BV10-BW10,IF(AND(AI10>=20,AI10<21,AK10>=0,AK10<=12),21-AI10-BV10-BW10,IF(AND(AI10<21,OR(AND(AK10>=0,AK10<=21),AND(AK10>=21,AK10<=23.99))),21-20-BV10-BW10)))))","v":{"v":0,"d":"0.00"}},"00:00:00","00:00:00","00:00:00","00:00:00","00:00:00","00:00:00",{"v":0,"d":"0.00"},{"v":0,"d":"0.00"},"06:00:00","00:00:00",{"$nulls":16},{"v":0,"d":"0.00"},{"v":0,"d":"0.00"},{"$f":"IF(C10=0,IF(AH10=0,0,IF(AH10>=0,AH10-BR10,IF(AND(AH10>=0,BV10>=0,$BV$5=\"ja\"),AH10-BV10,IF(AND(AH10>=0,BW10>=0,$BV$5=\"nein\"),AH10-BW10)))),0)","v":{"v":0,"d":"0.00"}},{"$f":"IF(L10=\"\",AM10,AN10)","v":{"v":0,"d":"0.00"}},null,null,{"v":0,"d":"0.00"},{"$f":"IF($BV$5=\"ja\",IF(OR(K10=\"\",C10=\"\"),0,IF(AND(S10=1,K10>0),(K10+$D$6+$D$6)*24,K10*24)),0)","v":{"v":0,"d":"0.00"}},{"$f":"IF($BV$5=\"nein\",IF(OR(K10=\"\",C10=0),0,IF(AND(S10=1,K10>0),(K10+$D$6+$D$6)*24,K10*24)),0)","v":{"v":0,"d":"0.00"}},{"v":0,"d":"0.00"}]
["Dienstag",{"$f":"B10+1","v":"2023-01-03"},{"$f":"'Einsatz 1'!C12","v":""},{"$f":"'Einsatz 1'!D12","v":0},{"$f":"'Einsatz 1'!E12","v":0},{"$f":"'Einsatz 1'!F12","v":0},{"$f":"'Einsatz 1'!G12","v":0},{"$f":"'Einsatz 1'!H12","v":"00:00:00"},null,null,"00:00:00",null,null,"00:00:00","00:00:00","21:00:00","06:00:00","",1,"00:00:00","00:00:00","00:00:00","00:00:00","00:00:00","00:00:00",{"v":0,"d":"0.00"},{"v":0,"d":"0.00"},{"v":0,"d":"0.00"},{"v":0,"d":"0.00"},{"v":0,"d":"0.00"},false,"00:00:00","00:00:00",{"v":0,"d":"0.00"},{"v":0,"d":"0.00"},{"v":0,"d":"0.00"},{"v":0,"d":"0.00"},{"v":0,"d":"0.00"},{"v":0,"d":"0.00"},{"v":0,"d":"0.00"},"00:00:00","00:00:00","00:00:00","00:00:00","00:00:00","00:00:00",{"v":0,"d":"0.00"},{"v":0,"d":"0.00"},"06:00:00","00:00:00",{"$nulls":16},{"v":0,"d":"0.00"},{"v":0,"d":"0.00"},{"v":0,"d":"0.00"},{"v":0,"d":"0.00"},null,null,{"v":0,"d":"0.00"},{"v":0,"d":"0.00"},{"v":0,"d":"0.00"},{"v":0,"d":"0.00"}]
["Mittwoch","2023-01-04",{"$f":"'Einsatz 1'!C13","v":""},{"$f":"'Einsatz 1'!D13","v":0},{"$f":"'Einsatz 1'!E13","v":0},{"$f":"'Einsatz 1'!F13","v":0},{"$f":"'Einsatz 1'!G13","v":0},{"$f":"'Einsatz 1'!H13","v":"00:00:00"},null,null,"00:00:00",null,null,"00:00:00","00:00:00","21:00:00","06:00:00","",1,"00:00:00","00:00:00","00:00:00","00:00:00","00:00:00","00:00:00",{"v":0,"d":"0.00"},{"v":0,"d":"0.00"},{"v":0,"d":"0.00"},{"v":0,"d":"0.00"},{"v":0,"d":"0.00"},false,"00:00:00","00:00:00",{"v":0,"d":"0.00"},{"v":0,"d":"0.00"},{"v":0,"d":"0.00"},{"v":0,"d":"0.00"},{"v":0,"d":"0.00"},{"v":0,"d":"0.00"},{"v":0,"d":"0.00"},"00:00:00","00:00:00","00:00:00","00:00:00","00:00:00","00:00:00",{"v":0,"d":"0.00"},{"v":0,"d":"0.00"},"06:00:00","00:00:00",{"$nulls":16},{"v":0,"d":"0.00"},{"v":0,"d":"0.00"},{"v":0,"d":"0.00"},{"v":0,"d":"0.00"},null,null,{"v":0,"d":"0.00"},{"v":0,"d":"0.00"},{"v":0,"d":"0.00"},{"v":0,"d":"0.00"}]
["Donnerstag","2023-01-05",{"$f":"'Einsatz 1'!C14","v":""},{"$f":"'Einsatz 1'!D14","v":0},{"$f":"'Einsatz 1'!E14","v":0},{"$f":"'Einsatz 1'!F14","v":0},{"$f":"'Einsatz 1'!G14","v":0},{"$f":"'Einsatz 1'!H14","v":"00:00:00"},null,null,"00:00:00",null,null,"00:00:00","00:00:00","21:00:00","06:00:00","",1,"00:00:00","00:00:00","00:00:00","00:00:00","00:00:00","00:00:00",{"v":0,"d":"0.00"},{"v":0,"d":"0.00"},{"v":0,"d":"0.00"},{"v":0,"d":"0.00"},{"v":0,"d":"0.00"},false,"00:00:00","00:00:00",{"v":0,"d":"0.00"},{"v":0,"d":"0.00"},{"v":0,"d":"0.00"},{"v":0,"d":"0.00"},{"v":0,"d":"0.00"},{"v":0,"d":"0.00"},{"v":0,"d":"0.00"},"00:00:00","00:00:00","00:00:00","00:00:00","00:00:00","00:00:00",{"v":0,"d":"0.00"},{"v":0,"d":"0.00"},"06:00:00","00:00:00",{"$nulls":16},{"v":0,"d":"0.00"},{"v":0,"d":"0.00"},{"v":0,"d":"0.00"},{"v":0,"d":"0.00"},null,null,{"v":0,"d":"0.00"},{"v":0,"d":"0.00"},{"v":0,"d":"0.00"},{"v":0,"d":"0.00"}]
["Freitag","2023-01-06",{"$f":"'Einsatz 1'!C15","v":""},{"$f":"'Einsatz 1'!D15","v":0},{"$f":"'Einsatz 1'!E15","v":0},{"$f":"'Einsatz 1'!F15","v":0},{"$f":"'Einsatz 1'!G15","v":0},{"$f":"'Einsatz 1'!H15","v":"00:00:00"},null,null,"00:00:00",null,null,"00:00:00","00:00:00","21:00:00","06:00:00","",1,"00:00:00","00:00:00","00:00:00","00:00:00","00:00:00","00:00:00",{"v":0,"d":"0.00"},{"v":0,"d":"0.00"},{"v":0,"d":"0.00"},{"v":0,"d":"0.00"},{"v":0,"d":"0.00"},false,"00:00:00","00:00:00",{"v":0,"d":"0.00"},{"v":0,"d":"0.00"},{"v":0,"d":"0.00"},{"v":0,"d":"0.00"},{"v":0,"d":"0.00"},{"v":0,"d":"0.00"},{"v":0,"d":"0.00"},"00:00:00","00:00:00","00:00:00","00:00:00","00:00:00","00:00:00",{"v":0,"d":"0.00"},{"v":0,"d":"0.00"},"06:00:00","00:00:00",{"$nulls":16},{"v":0,"d":"0.00"},{"v":0,"d":"0.00"},{"v":0,"d":"0.00"},{"v":0,"d":"0.00"},null,null,{"v":0,"d":"0.00"},{"v":0,"d":"0.00"},{"v":0,"d":"0.00"},{"v":0,"d":"0.00"}]
["Samstag","2023-01-07",{"$f":"'Einsatz 1'!C16","v":""},{"$f":"'Einsatz 1'!D16","v":0},{"$f":"'Einsatz 1'!E16","v":0},{"$f":"'Einsatz 1'!F16","v":0},{"$f":"'Einsatz 1'!G16","v":0},{"$f":"'Einsatz 1'!H16","v":"00:00:00"},null,null,"00:00:00",null,null,"00:00:00","00:00:00","21:00:00","06:00:00","",1,"00:00:00","00:00:00","00:00:00","00:00:00","00:00:00","00:00:00",{"v":0,"d":"0.00"},{"v":0,"d":"0.00"},{"v":0,"d":"0.00"},{"v":0,"d":"0.00"},{"v":0,"d":"0.00"},false,"00:00:00","00:00:00",{"v":0,"d":"0.00"},{"v":0,"d":"0.00"},{"v":0,"d":"0.00"},{"v":0,"d":"0.00"},{"v":0,"d":"0.00"},{"v":0,"d":"0.00"},{"v":0,"d":"0.00"},"00:00:00","00:00:00","00:00:00","00:00:00","00:00:00","00:00:00",{"v":0,"d":"0.00"},{"v":0,"d":"0.00"},"06:00:00","00:00:00",{"$nulls":16},{"v":0,"d":"0.00"},{"v":0,"d":"0.00"},{"v":0,"d":"0.00"},{"v":0,"d":"0.00"},null,null,{"v":0,"d":"0.00"},{"v":0,"d":"0.00"},{"v":0,"d":"0.00"},{"v":0,"d":"0.00"}]
["Sonntag","2023-01-08",{"$f":"'Einsatz 1'!C17","v":""},{"$f":"'Einsatz 1'!D17","v":0},{"$f":"'Einsatz 1'!E17","v":0},{"$f":"'Einsatz 1'!F17","v":0},{"$f":"'Einsatz 1'!G17","v":0},{"$f":"'Einsatz 1'!H17","v":"00:00:00"},null,null,"00:00:00",null,null,"00:00:00","00:00:00","21:00:00","06:00:00","",1,"00:00:00","00:00:00","00:00:00","00:00:00","00:00:00","00:00:00",{"v":0,"d":"0.00"},{"v":0,"d":"0.00"},{"v":0,"d":"0.00"},{"v":0,"d":"0.00"},{"v":0,"d":"0.00"},false,"00:00:00","00:00:00",{"v":0,"d":"0.00"},{"v":0,"d":"0.00"},{"v":0,"d":"0.00"},{"v":0,"d":"0.00"},{"v":0,"d":"0.00"},{"v":0,"d":"0.00"},{"v":0,"d":"0.00"},"00:00:00","00:00:00","00:00:00","00:00:00","00:00:00","00:00:00",{"v":0,"d":"0.00"},{"v":0,"d":"0.00"},"06:00:00","00:00:00",{"$nulls":16},{"v":0,"d":"0.00"},{"v":0,"d":"0.00"},{"v":0,"d":"0.00"},{"v":0,"d":"0.00"},null,null,{"v":0,"d":"0.00"},{"v":0,"d":"0.00"},{"v":0,"d":"0.00"},{"v":0,"d":"0.00"}]
["Montag","2023-01-09",{"$f":"'Einsatz 1'!C18","v":""},{"$f":"'Einsatz 1'!D18","v":0},{"$f":"'Einsatz 1'!E18","v":0},{"$f":"'Einsatz 1'!F18","v":0},{"$f":"'Einsatz 1'!G18","v":0},{"$f":"'Einsatz 1'!H18","v":"00:00:00"},null,null,"00:00:00",null,null,"00:00:00","00:00:00","21:00:00","06:00:00","",1,"00:00:00","00:00:00","00:00:00","00:00:00","00:00:00","00:00:00",{"v":0,"d":"0.00"},{"v":0,"d":"0.00"},{"v":0,"d":"0.00"},{"v":0,"d":"0.00"},{"v":0,"d":"0.00"},false,"00:00:00","00:00:00",{"v":0,"d":"0.00"},{"v":0,"d":"0.00"},{"v":0,"d":"0.00"},{"v":0,"d":"0.00"},{"v":0,"d":"0.00"},{"v":0,"d":"0.00"},{"v":0,"d":"0.00"},"00:00:00","00:00:00","00:00:00","00:00:00","00:00:00","00:00:00",{"v":0,"d":"0.00"},{"v":0,"d":"0.00"},"06:00:00","00:00:00",{"$nulls":16},{"v":0,"d":"0.00"},{"v":0,"d":"0.00"},{"v":0,"d":"0.00"},{"v":0,"d":"0.00"},null,null,{"v":0,"d":"0.00"},{"v":0,"d":"0.00"},{"v":0,"d":"0.00"},{"v":0,"d":"0.00"}]
["Dienstag","2023-01-10",{"$f":"'Einsatz 1'!C19","v":""},{"$f":"'Einsatz 1'!D19","v":0},{"$f":"'Einsatz 1'!E19","v":0},{"$f":"'Einsatz 1'!F19","v":0},{"$f":"'Einsatz 1'!G19","v":0},{"$f":"'Einsatz 1'!H19","v":"00:00:00"},null,null,"00:00:00",null,null,"00:00:00","00:00:00","21:00:00","06:00:00","",1,"00:00:00","00:00:00","00:00:00","00:00:00","00:00:00","00:00:00",{"v":0,"d":"0.00"},{"v":0,"d":"0.00"},{"v":0,"d":"0.00"},{"v":0,"d":"0.00"},{"v":0,"d":"0.00"},false,"00:00:00","00:00:00",{"v":0,"d":"0.00"},{"v":0,"d":"0.00"},{"v":0,"d":"0.00"},{"v":0,"d":"0.00"},{"v":0,"d":"0.00"},{"v":0,"d":"0.00"},{"v":0,"d":"0.00"},"00:00:00","00:00:00","00:00:00","00:00:00","00:00:00","00:00:00",{"v":0,"d":"0.00"},{"v":0,"d":"0.00"},"06:00:00","00:00:00",{"$nulls":16},{"v":0,"d":"0.00"},{"v":0,"d":"0.00"},{"v":0,"d":"0.00"},{"v":0,"d":"0.00"},null,null,{"v":0,"d":"0.00"},{"v":0,"d":"0.00"},{"v":0,"d":"0.00"},{"v":0,"d":"0.00"}]
["Mittwoch","2023-01-11",{"$f":"'Einsatz 1'!C20","v":""},{"$f":"'Einsatz 1'!D20","v":0},{"$f":"'Einsatz 1'!E20","v":0},{"$f":"'Einsatz 1'!F20","v":0},{"$f":"'Einsatz 1'!G20","v":0},{"$f":"'Einsatz 1'!H20","v":"00:00:00"},null,null,"00:00:00",null,null,"00:00:00","00:00:00","21:00:00","06:00:00","",1,"00:00:00","00:00:00","00:00:00","00:00:00","00:00:00","00:00:00",{"v":0,"d":"0.00"},{"v":0,"d":"0.00"},{"v":0,"d":"0.00"},{"v":0,"d":"0.00"},{"v":0,"d":"0.00"},false,"00:00:00","00:00:00",{"v":0,"d":"0.00"},{"v":0,"d":"0.00"},{"v":0,"d":"0.00"},{"v":0,"d":"0.00"},{"v":0,"d":"0.00"},{"v":0,"d":"0.00"},{"v":0,"d":"0.00"},"00:00:00","00:00:00","00:00:00","00:00:00","00:00:00","00:00:00",{"v":0,"d":"0.00"},{"v":0,"d":"0.00"},"06:00:00","00:00:00",{"$nulls":16},{"v":0,"d":"0.00"},{"v":0,"d":"0.00"},{"v":0,"d":"0.00"},{"v":0,"d":"0.00"},null,null,{"v":0,"d":"0.00"},{"v":0,"d":"0.00"},{"v":0,"d":"0.00"},{"v":0,"d":"0.00"}]
["Donnerstag","2023-01-12",{"$f":"'Einsatz 1'!C21","v":""},{"$f":"'Einsatz 1'!D21","v":0},{"$f":"'Einsatz 1'!E21","v":0},{"$f":"'Einsatz 1'!F21","v":0},{"$f":"'Einsatz 1'!G21","v":0},{"$f":"'Einsatz 1'!H21","v":"00:00:00"},null,null,"00:00:00",null,null,"00:00:00","00:00:00","21:00:00","06:00:00","",1,"00:00:00","00:00:00","00:00:00","00:00:00","00:00:00","00:00:00",{"v":0,"d":"0.00"},{"v":0,"d":"0.00"},{"v":0,"d":"0.00"},{"v":0,"d":"0.00"},{"v":0,"d":"0.00"},false,"00:00:00","00:00:00",{"v":0,"d":"0.00"},{"v":0,"d":"0.00"},{"v":0,"d":"0.00"},{"v":0,"d":"0.00"},{"v":0,"d":"0.00"},{"v":0,"d":"0.00"},{"v":0,"d":"0.00"},"00:00:00","00:00:00","00:00:00","00:00:00","00:00:00","00:00:00",{"v":0,"d":"0.00"},{"v":0,"d":"0.00"},"06:00:00","00:00:00",{"$nulls":16},{"v":0,"d":"0.00"},{"v":0,"d":"0.00"},{"v":0,"d":"0.00"},{"v":0,"d":"0.00"},null,null,{"v":0,"d":"0.00"},{"v":0,"d":"0.00"},{"v":0,"d":"0.00"},{"v":0,"d":"0.00"}]
["Freitag","2023-01-13",{"$f":"'Einsatz 1'!C22","v":""},{"$f":"'Einsatz 1'!D22","v":0},{"$f":"'Einsatz 1'!E22","v":0},{"$f":"'Einsatz 1'!F22","v":0},{"$f":"'Einsatz 1'!G22","v":0},{"$f":"'Einsatz 1'!H22","v":"00:00:00"},null,null,"00:00:00",null,null,"00:00:00","00:00:00","21:00:00","06:00:00","",1,"00:00:00","00:00:00","00:00:00","00:00:00","00:00:00","00:00:00",{"v":0,"d":"0.00"},{"v":0,"d":"0.00"},{"v":0,"d":"0.00"},{"v":0,"d":"0.00"},{"v":0,"d":"0.00"},false,"00:00:00","00:00:00",{"v":0,"d":"0.00"},{"v":0,"d":"0.00"},{"v":0,"d":"0.00"},{"v":0,"d":"0.00"},{"v":0,"d":"0.00"},{"v":0,"d":"0.00"},{"v":0,"d":"0.00"},"00:00:00","00:00:00","00:00:00","00:00:00","00:00:00","00:00:00",{"v":0,"d":"0.00"},{"v":0,"d":"0.00"},"06:00:00","00:00:00",{"$nulls":16},{"v":0,"d":"0.00"},{"v":0,"d":"0.00"},{"v":0,"d":"0.00"},{"v":0,"d":"0.00"},null,null,{"v":0,"d":"0.00"},{"v":0,"d":"0.00"},{"v":0,"d":"0.00"},{"v":0,"d":"0.00"}]
["Samstag","2023-01-14",{"$f":"'Einsatz 1'!C23","v":""},{"$f":"'Einsatz 1'!D23","v":0},{"$f":"'Einsatz 1'!E23","v":0},{"$f":"'Einsatz 1'!F23","v":0},{"$f":"'Einsatz 1'!G23","v":0},{"$f":"'Einsatz 1'!H23","v":"00:00:00"},null,null,"00:00:00",null,null,"00:00:00","00:00:00","21:00:00","06:00:00","",1,"00:00:00","00:00:00","00:00:00","00:00:00","00:00:00","00:00:00",{"v":0,"d":"0.00"},{"v":0,"d":"0.00"},{"v":0,"d":"0.00"},{"v":0,"d":"0.00"},{"v":0,"d":"0.00"},false,"00:00:00","00:00:00",{"v":0,"d":"0.00"},{"v":0,"d":"0.00"},{"v":0,"d":"0.00"},{"v":0,"d":"0.00"},{"v":0,"d":"0.00"},{"v":0,"d":"0.00"},{"v":0,"d":"0.00"},"00:00:00","00:00:00","00:00:00","00:00:00","00:00:00","00:00:00",{"v":0,"d":"0.00"},{"v":0,"d":"0.00"},"06:00:00","00:00:00",{"$nulls":16},{"v":0,"d":"0.00"},{"v":0,"d":"0.00"},{"v":0,"d":"0.00"},{"v":0,"d":"0.00"},null,null,{"v":0,"d":"0.00"},{"v":0,"d":"0.00"},{"v":0,"d":"0.00"},{"v":0,"d":"0.00"}]
["Sonntag","2023-01-15",{"$f":"'Einsatz 1'!C24","v":""},{"$f":"'Einsatz 1'!D24","v":0},{"$f":"'Einsatz 1'!E24","v":0},{"$f":"'Einsatz 1'!F24","v":0},{"$f":"'Einsatz 1'!G24","v":0},{"$f":"'Einsatz 1'!H24","v":"00:00:00"},null,null,"00:00:00",null,null,"00:00:00","00:00:00","21:00:00","06:00:00","",1,"00:00:00","00:00:00","00:00:00","00:00:00","00:00:00","00:00:00",{"v":0,"d":"0.00"},{"v":0,"d":"0.00"},{"v":0,"d":"0.00"},{"v":0,"d":"0.00"},{"v":0,"d":"0.00"},false,"00:00:00","00:00:00",{"v":0,"d":"0.00"},{"v":0,"d":"0.00"},{"v":0,"d":"0.00"},{"v":0,"d":"0.00"},{"v":0,"d":"0.00"},{"v":0,"d":"0.00"},{"v":0,"d":"0.00"},"00:00:00","00:00:00","00:00:00","00:00:00","00:00:00","00:00:00",{"v":0,"d":"0.00"},{"v":0,"d":"0.00"},"06:00:00","00:00:00",{"$nulls":16},{"v":0,"d":"0.00"},{"v":0,"d":"0.00"},{"v":0,"d":"0.00"},{"v":0,"d":"0.00"},null,null,{"v":0,"d":"0.00"},{"v":0,"d":"0.00"},{"v":0,"d":"0.00"},{"v":0,"d":"0.00"}]
["Montag","2023-01-16",{"$f":"'Einsatz 1'!C25","v":""},{"$f":"'Einsatz 1'!D25","v":0},{"$f":"'Einsatz 1'!E25","v":0},{"$f":"'Einsatz 1'!F25","v":0},{"$f":"'Einsatz 1'!G25","v":0},{"$f":"'Einsatz 1'!H25","v":"00:00:00"},null,null,"00:00:00",null,null,"00:00:00","00:00:00","21:00:00","06:00:00","",1,"00:00:00","00:00:00","00:00:00","00:00:00","00:00:00","00:00:00",{"v":0,"d":"0.00"},{"v":0,"d":"0.00"},{"v":0,"d":"0.00"},{"v":0,"d":"0.00"},{"v":0,"d":"0.00"},false,"00:00:00","00:00:00",{"v":0,"d":"0.00"},{"v":0,"d":"0.00"},{"v":0,"d":"0.00"},{"v":0,"d":"0.00"},{"v":0,"d":"0.00"},{"v":0,"d":"0.00"},{"v":0,"d":"0.00"},"00:00:00","00:00:00","00:00:00","00:00:00","00:00:00","00:00:00",{"v":0,"d":"0.00"},{"v":0,"d":"0.00"},"06:00:00","00:00:00",{"$nulls":16},{"v":0,"d":"0.00"},{"v":0,"d":"0.00"},{"v":0,"d":"0.00"},{"v":0,"d":"0.00"},null,null,{"v":0,"d":"0.00"},{"v":0,"d":"0.00"},{"v":0,"d":"0.00"},{"v":0,"d":"0.00"}]
["Dienstag","2023-01-17",{"$f":"'Einsatz 1'!C26","v":""},{"$f":"'Einsatz 1'!D26","v":0},{"$f":"'Einsatz 1'!E26","v":0},{"$f":"'Einsatz 1'!F26","v":0},{"$f":"'Einsatz 1'!G26","v":0},{"$f":"'Einsatz 1'!H26","v":"00:00:00"},null,null,"00:00:00",null,null,"00:00:00","00:00:00","21:00:00","06:00:00","",1,"00:00:00","00:00:00","00:00:00","00:00:00","00:00:00","00:00:00",{"v":0,"d":"0.00"},{"v":0,"d":"0.00"},{"v":0,"d":"0.00"},{"v":0,"d":"0.00"},{"v":0,"d":"0.00"},false,"00:00:00","00:00:00",{"v":0,"d":"0.00"},{"v":0,"d":"0.00"},{"v":0,"d":"0.00"},{"v":0,"d":"0.00"},{"v":0,"d":"0.00"},{"v":0,"d":"0.00"},{"v":0,"d":"0.00"},"00:00:00","00:00:00","00:00:00","00:00:00","00:00:00","00:00:00",{"v":0,"d":"0.00"},{"v":0,"d":"0.00"},"06:00:00","00:00:00",{"$nulls":16},{"v":0,"d":"0.00"},{"v":0,"d":"0.00"},{"v":0,"d":"0.00"},{"v":0,"d":"0.00"},null,null,{"v":0,"d":"0.00"},{"v":0,"d":"0.00"},{"v":0,"d":"0.00"},{"v":0,"d":"0.00"}]
["Mittwoch","2023-01-18",{"$f":"'Einsatz 1'!C27","v":""},{"$f":"'Einsatz 1'!D27","v":0},{"$f":"'Einsatz 1'!E27","v":0},{"$f":"'Einsatz 1'!F27","v":0},{"$f":"'Einsatz 1'!G27","v":0},{"$f":"'Einsatz 1'!H27","v":"00:00:00"},null,null,"00:00:00",null,null,"00:00:00","00:00:00","21:00:00","06:00:00","",1,"00:00:00","00:00:00","00:00:00","00:00:00","00:00:00","00:00:00",{"v":0,"d":"0.00"},{"v":0,"d":"0.00"},{"v":0,"d":"0.00"},{"v":0,"d":"0.00"},{"v":0,"d":"0.00"},false,"00:00:00","00:00:00",{"v":0,"d":"0.00"},{"v":0,"d":"0.00"},{"v":0,"d":"0.00"},{"v":0,"d":"0.00"},{"v":0,"d":"0.00"},{"v":0,"d":"0.00"},{"v":0,"d":"0.00"},"00:00:00","00:00:00","00:00:00","00:00:00","00:00:00","00:00:00",{"v":0,"d":"0.00"},{"v":0,"d":"0.00"},"06:00:00","00:00:00",{"$nulls":16},{"v":0,"d":"0.00"},{"v":0,"d":"0.00"},{"v":0,"d":"0.00"},{"v":0,"d":"0.00"},null,null,{"v":0,"d":"0.00"},{"v":0,"d":"0.00"},{"v":0,"d":"0.00"},{"v":0,"d":"0.00"}]
["Donnerstag","2023-01-19",{"$f":"'Einsatz 1'!C28","v":""},{"$f":"'Einsatz 1'!D28","v":0},{"$f":"'Einsatz 1'!E28","v":0},{"$f":"'Einsatz 1'!F28","v":0},{"$f":"'Einsatz 1'!G28","v":0},{"$f":"'Einsatz 1'!H28","v":"00:00:00"},null,null,"00:00:00",null,null,"00:00:00","00:00:00","21:00:00","06:00:00","",1,"00:00:00","00:00:00","00:00:00","00:00:00","00:00:00","00:00:00",{"v":0,"d":"0.00"},{"v":0,"d":"0.00"},{"v":0,"d":"0.00"},{"v":0,"d":"0.00"},{"v":0,"d":"0.00"},false,"00:00:00","00:00:00",{"v":0,"d":"0.00"},{"v":0,"d":"0.00"},{"v":0,"d":"0.00"},{"v":0,"d":"0.00"},{"v":0,"d":"0.00"},{"v":0,"d":"0.00"},{"v":0,"d":"0.00"},"00:00:00","00:00:00","00:00:00","00:00:00","00:00:00","00:00:00",{"v":0,"d":"0.00"},{"v":0,"d":"0.00"},"06:00:00","00:00:00",{"$nulls":16},{"v":0,"d":"0.00"},{"v":0,"d":"0.00"},{"v":0,"d":"0.00"},{"v":0,"d":"0.00"},null,null,{"v":0,"d":"0.00"},{"v":0,"d":"0.00"},{"v":0,"d":"0.00"},{"v":0,"d":"0.00"}]
["Freitag","2023-01-20",{"$f":"'Einsatz 1'!C29","v":""},{"$f":"'Einsatz 1'!D29","v":0},{"$f":"'Einsatz 1'!E29","v":0},{"$f":"'Einsatz 1'!F29","v":0},{"$f":"'Einsatz 1'!G29","v":0},{"$f":"'Einsatz 1'!H29","v":"00:00:00"},null,null,"00:00:00",null,null,"00:00:00","00:00:00","21:00:00","06:00:00","",1,"00:00:00","00:00:00","00:00:00","00:00:00","00:00:00","00:00:00",{"v":0,"d":"0.00"},{"v":0,"d":"0.00"},{"v":0,"d":"0.00"},{"v":0,"d":"0.00"},{"v":0,"d":"0.00"},false,"00:00:00","00:00:00",{"v":0,"d":"0.00"},{"v":0,"d":"0.00"},{"v":0,"d":"0.00"},{"v":0,"d":"0.00"},{"v":0,"d":"0.00"},{"v":0,"d":"0.00"},{"v":0,"d":"0.00"},"00:00:00","00:00:00","00:00:00","00:00:00","00:00:00","00:00:00",{"v":0,"d":"0.00"},{"v":0,"d":"0.00"},"06:00:00","00:00:00",{"$nulls":16},{"v":0,"d":"0.00"},{"v":0,"d":"0.00"},{"v":0,"d":"0.00"},{"v":0,"d":"0.00"},null,null,{"v":0,"d":"0.00"},{"v":0,"d":"0.00"},{"v":0,"d":"0.00"},{"v":0,"d":"0.00"}]
["Samstag","2023-01-21",{"$f":"'Einsatz 1'!C30","v":""},{"$f":"'Einsatz 1'!D30","v":0},{"$f":"'Einsatz 1'!E30","v":0},{"$f":"'Einsatz 1'!F30","v":0},{"$f":"'Einsatz 1'!G30","v":0},{"$f":"'Einsatz 1'!H30","v":"00:00:00"},null,null,"00:00:00",null,null,"00:00:00","00:00:00","21:00:00","06:00:00","",1,"00:00:00","00:00:00","00:00:00","00:00:00","00:00:00","00:00:00",{"v":0,"d":"0.00"},{"v":0,"d":"0.00"},{"v":0,"d":"0.00"},{"v":0,"d":"0.00"},{"v":0,"d":"0.00"},false,"00:00:00","00:00:00",{"v":0,"d":"0.00"},{"v":0,"d":"0.00"},{"v":0,"d":"0.00"},{"v":0,"d":"0.00"},{"v":0,"d":"0.00"},{"v":0,"d":"0.00"},{"v":0,"d":"0.00"},"00:00:00","00:00:00","00:00:00","00:00:00","00:00:00","00:00:00",{"v":0,"d":"0.00"},{"v":0,"d":"0.00"},"06:00:00","00:00:00",{"$nulls":16},{"v":0,"d":"0.00"},{"v":0,"d":"0.00"},{"v":0,"d":"0.00"},{"v":0,"d":"0.00"},null,null,{"v":0,"d":"0.00"},{"v":0,"d":"0.00"},{"v":0,"d":"0.00"},{"v":0,"d":"0.00"}]
["Sonntag","2023-01-22",{"$f":"'Einsatz 1'!C31","v":""},{"$f":"'Einsatz 1'!D31","v":0},{"$f":"'Einsatz 1'!E31","v":0},{"$f":"'Einsatz 1'!F31","v":0},{"$f":"'Einsatz 1'!G31","v":0},{"$f":"'Einsatz 1'!H31","v":"00:00:00"},null,null,"00:00:00",null,null,"00:00:00","00:00:00","21:00:00","06:00:00","",1,"00:00:00","00:00:00","00:00:00","00:00:00","00:00:00","00:00:00",{"v":0,"d":"0.00"},{"v":0,"d":"0.00"},{"v":0,"d":"0.00"},{"v":0,"d":"0.00"},{"v":0,"d":"0.00"},false,"00:00:00","00:00:00",{"v":0,"d":"0.00"},{"v":0,"d":"0.00"},{"v":0,"d":"0.00"},{"v":0,"d":"0.00"},{"v":0,"d":"0.00"},{"v":0,"d":"0.00"},{"v":0,"d":"0.00"},"00:00:00","00:00:00","00:00:00","00:00:00","00:00:00","00:00:00",{"v":0,"d":"0.00"},{"v":0,"d":"0.00"},"06:00:00","00:00:00",{"$nulls":16},{"v":0,"d":"0.00"},{"v":0,"d":"0.00"},{"v":0,"d":"0.00"},{"v":0,"d":"0.00"},null,null,{"v":0,"d":"0.00"},{"v":0,"d":"0.00"},{"v":0,"d":"0.00"},{"v":0,"d":"0.00"}]
["Montag","2023-01-23",{"$f":"'Einsatz 1'!C32","v":""},{"$f":"'Einsatz 1'!D32","v":0},{"$f":"'Einsatz 1'!E32","v":0},{"$f":"'Einsatz 1'!F32","v":0},{"$f":"'Einsatz 1'!G32","v":0},{"$f":"'Einsatz 1'!H32","v":"00:00:00"},null,null,"00:00:00",null,null,"00:00:00","00:00:00","21:00:00","06:00:00","",1,"00:00:00","00:00:00","00:00:00","00:00:00","00:00:00","00:00:00",{"v":0,"d":"0.00"},{"v":0,"d":"0.00"},{"v":0,"d":"0.00"},{"v":0,"d":"0.00"},{"v":0,"d":"0.00"},false,"00:00:00","00:00:00",{"v":0,"d":"0.00"},{"v":0,"d":"0.00"},{"v":0,"d":"0.00"},{"v":0,"d":"0.00"},{"v":0,"d":"0.00"},{"v":0,"d":"0.00"},{"v":0,"d":"0.00"},"00:00:00","00:00:00","00:00:00","00:00:00","00:00:00","00:00:00",{"v":0,"d":"0.00"},{"v":0,"d":"0.00"},"06:00:00","00:00:00",{"$nulls":16},{"v":0,"d":"0.00"},{"v":0,"d":"0.00"},{"v":0,"d":"0.00"},{"v":0,"d":"0.00"},null,null,{"v":0,"d":"0.00"},{"v":0,"d":"0.00"},{"v":0,"d":"0.00"},{"v":0,"d":"0.00"}]
["Dienstag","2023-01-24",{"$f":"'Einsatz 1'!C33","v":""},{"$f":"'Einsatz 1'!D33","v":0},{"$f":"'Einsatz 1'!E33","v":0},{"$f":"'Einsatz 1'!F33","v":0},{"$f":"'Einsatz 1'!G33","v":0},{"$f":"'Einsatz 1'!H33","v":"00:00:00"},null,null,"00:00:00",null,null,"00:00:00","00:00:00","21:00:00","06:00:00","",1,"00:00:00","00:00:00","00:00:00","00:00:00","00:00:00","00:00:00",{"v":0,"d":"0.00"},{"v":0,"d":"0.00"},{"v":0,"d":"0.00"},{"v":0,"d":"0.00"},{"v":0,"d":"0.00"},false,"00:00:00","00:00:00",{"v":0,"d":"0.00"},{"v":0,"d":"0.00"},{"v":0,"d":"0.00"},{"v":0,"d":"0.00"},{"v":0,"d":"0.00"},{"v":0,"d":"0.00"},{"v":0,"d":"0.00"},"00:00:00","00:00:00","00:00:00","00:00:00","00:00:00","00:00:00",{"v":0,"d":"0.00"},{"v":0,"d":"0.00"},"06:00:00","00:00:00",{"$f":"IF(I32=\"\",0,IF(OR(I32>=AW32,I32<=AX32),1,IF(OR(J32>=AW32,J32<=AX32),1,IF(AND(I32<=TN32,J32>=AX32,J32<I32),1,0))))","v":0},{"$f":"(J32+$D$6)*24","v":{"v":0,"d":"0.00"}},{"v":24,"d":"24.00"},{"v":14,"d":"14.00"},{"$f":"IF(I32=\"\",0,IF(AY32,IF(AND((I32-$D$6)<=AW32,(I32-$D$6)>=AX32),AW32,IF(OR((I32-$D$6)>=AW32,(I32-$D$6)<=AX32),I32-$D$6,AW32)),0))","v":"00:00:00"},{"$f":"IF(OR(J32=\"\",AY32=0),0,IF(AY32=1,IF(AZ32>BA32,AX32,J32+$D$6)))","v":"00:00:00"},{"$f":"IF(I32=\"\",0,IF(AY32,IF(AND(I32<=AW32,I32>=AX32),AW32,IF(OR(I32>=AW32,I32<=AX32),I32,AW32)),0))","v":"00:00:00"},{"$f":"IF(OR(AY32=0,J32=0),0,IF(J32<=AX32,J32,IF(J32>=AW32,J32,AX32)))","v":"00:00:00"},{"$f":"IF(BE32=0,0,IF(BE32<=0.25,BD32-BC32,(BD32+1)-BC32))","v":"00:00:00"},{"$f":"IF(BE32=0,0,IF(BE32<=0.25,BF32-BE32,(BF32+1)-BE32))","v":"00:00:00"},{"$f":"BC32*24","v":{"v":0,"d":"0.00"}},{"$f":"BD32*24","v":{"v":0,"d":"0.00"}},{"$f":"BE32*24","v":{"v":0,"d":"0.00"}},{"$f":"BF32*24","v":{"v":0,"d":"0.00"}},{"$f":"IF(AND(I32>0,$BU$3=12,BI32<=BB32,S32=1),BJ32-BI32,0)","v":{"v":0,"d":"0.00"}},{"$f":"IF(AND(I32>0,BJ32>BB32,S32=1),IF(BI32-BB32<0,BG32*24-24-BM32,BI32-BB32),IF(BL32>BB32,BB32-BK32,0))","v":{"v":0,"d":"0.00"}},{"v":0,"d":"0.00"},{"v":0,"d":"0.00"},{"v":0,"d":"0.00"},{"v":0,"d":"0.00"},{"$f":"IF(OR($BU$3<12,I32=\"\"),0,BM32)","v":{"v":0,"d":"0.00"}},{"$f":"IF(AND($BU$3=12,BJ32>14,BJ32<=BA32),BJ32-14,IF(AND($BU$3=12,BL32>14,BL32<=BA32),BL32-14,0))","v":{"v":0,"d":"0.00"}},{"v":0,"d":"0.00"},{"v":0,"d":"0.00"},{"v":0,"d":"0.00"},{"v":0,"d":"0.00"}]
["Mittwoch","2023-01-25",{"$f":"'Einsatz 1'!C34","v":""},{"$f":"'Einsatz 1'!D34","v":0},{"$f":"'Einsatz 1'!E34","v":0},{"$f":"'Einsatz 1'!F34","v":0},{"$f":"'Einsatz 1'!G34","v":0},{"$f":"'Einsatz 1'!H34","v":"00:00:00"},null,null,"00:00:00",null,null,"00:00:00","00:00:00","21:00:00","06:00:00","",1,"00:00:00","00:00:00","00:00:00","00:00:00","00:00:00","00:00:00",{"v":0,"d":"0.00"},{"v":0,"d":"0.00"},{"v":0,"d":"0.00"},{"v":0,"d":"0.00"},{"v":0,"d":"0.00"},false,"00:00:00","00:00:00",{"v":0,"d":"0.00"},{"v":0,"d":"0.00"},{"v":0,"d":"0.00"},{"v":0,"d":"0.00"},{"v":0,"d":"0.00"},{"v":0,"d":"0.00"},{"v":0,"d":"0.00"},"00:00:00","00:00:00","00:00:00","00:00:00","00:00:00","00:00:00",{"v":0,"d":"0.00"},{"v":0,"d":"0.00"},"06:00:00","00:00:00",{"$f":"IF(I33=\"\",0,IF(OR(I33>=AW33,I33<=AX33),1,IF(OR(J33>=AW33,J33<=AX33),1,IF(AND(I33<=TN33,J33>=AX33,J33<I33),1,0))))","v":0},{"$f":"(J33+$D$6)*24","v":{"v":0,"d":"0.00"}},{"v":24,"d":"24.00"},{"v":0,"d":"0.00"},{"$f":"I33*24","v":{"v":0,"d":"0.00"}},{"$f":"IF(OR(J33=\"\",AY33=0),0,IF(AY33=1,IF(AZ33>BA33,AX33,J33+$D$6)))","v":0},{"$f":"IF(I33=\"\",0,IF(AY33,IF(AND(I33<=AW33,I33>=AX33),AX33,IF(OR(I33>=AW33,I33<=AX33),I33,AW33)),0))","v":0},{"$f":"IF(OR(AY33=0,J33=0),0,IF(J33<=AX33,J33,IF(J33>=AW33,J33,AX33)))","v":"00:00:00"},null,{"$f":"IF(BE33=0,0,IF(BE33<=0.25,BF33-BE33,(BF33+1)-BE33))","v":"00:00:00"},{"$f":"IF(I33=\"\",0,IF(AY33,IF(AND((BC33-$G$6)<=BB33,),BB33,IF(OR((BC33-$G$6)>=BB33),BC33-$G$6,BB33)),0))","v":{"v":0,"d":"0.00"}},{"$f":"BD33*24","v":{"v":0,"d":"0.00"}},{"$f":"I33*24","v":{"v":0,"d":"0.00"}},{"$f":"BF33*24","v":{"v":0,"d":"0.00"}},{"$f":"BJ33-BI33","v":{"v":0,"d":"0.00"}},{"$f":"BL33-BK33","v":{"v":0,"d":"0.00"}},{"v":0,"d":"0.00"},{"v":0,"d":"0.00"},{"v":0,"d":"0.00"},{"v":0,"d":"0.00"},null,{"$f":"IF(AND(BU3=12,K33>0),IF(S33=1,BM33,BN33),0)","v":{"v":0,"d":"0.00"}},{"v":0,"d":"0.00"},{"v":0,"d":"0.00"},{"v":0,"d":"0.00"},{"v":0,"d":"0.00"}]
["Donnerstag","2023-01-26",{"$f":"'Einsatz 1'!C35","v":""},{"$f":"'Einsatz 1'!D35","v":0},{"$f":"'Einsatz 1'!E35","v":0},{"$f":"'Einsatz 1'!F35","v":0},{"$f":"'Einsatz 1'!G35","v":0},{"$f":"'Einsatz 1'!H35","v":"00:00:00"},null,null,"00:00:00",null,null,"00:00:00","00:00:00","21:00:00","06:00:00","",1,"00:00:00","00:00:00","00:00:00","00:00:00","00:00:00","00:00:00",{"v":0,"d":"0.00"},{"v":0,"d":"0.00"},{"v":0,"d":"0.00"},{"v":0,"d":"0.00"},{"v":0,"d":"0.00"},false,"00:00:00","00:00:00",{"v":0,"d":"0.00"},{"v":0,"d":"0.00"},{"v":0,"d":"0.00"},{"v":0,"d":"0.00"},{"v":0,"d":"0.00"},{"v":0,"d":"0.00"},{"v":0,"d":"0.00"},"00:00:00","00:00:00","00:00:00","00:00:00","00:00:00","00:00:00",{"v":0,"d":"0.00"},{"v":0,"d":"0.00"},"06:00:00","00:00:00",{"$f":"IF(I34=\"\",0,IF(OR(I34>=AW34,I34<=AX34),1,IF(OR(J34>=AW34,J34<=AX34),1,IF(AND(I34<=TN34,J34>=AX34,J34<I34),1,0))))","v":0},{"$f":"(J34+$D$6)*24","v":{"v":0,"d":"0.00"}},{"v":24,"d":"24.00"},{"v":0,"d":"0.00"},{"$f":"I34*24","v":{"v":0,"d":"0.00"}},{"$f":"IF(OR(J34=\"\",AY34=0),0,IF(AY34=1,IF(AZ34>BA34,AX34,J34+$D$6)))","v":0},{"$f":"IF(I34=\"\",0,IF(AY34,IF(AND(I34<=AW34,I34>=AX34),AX34,IF(OR(I34>=AW34,I34<=AX34),I34,AW34)),0))","v":0},{"$f":"IF(OR(AY34=0,J34=0),0,IF(J34<=AX34,J34,IF(J34>=AW34,J34,AX34)))","v":"00:00:00"},null,{"$f":"IF(BE34=0,0,IF(BE34<=0.25,BF34-BE34,(BF34+1)-BE34))","v":"00:00:00"},{"$f":"IF(I34=\"\",0,IF(AY34,IF(AND((BC34-$G$6)<=BB34,),BB34,IF(OR((BC34-$G$6)>=BB34),BC34-$G$6,BB34)),0))","v":{"v":0,"d":"0.00"}},{"$f":"BD34*24","v":{"v":0,"d":"0.00"}},{"$f":"I34*24","v":{"v":0,"d":"0.00"}},{"$f":"BF34*24","v":{"v":0,"d":"0.00"}},{"$f":"BJ34-BI34","v":{"v":0,"d":"0.00"}},{"$f":"BL34-BK34","v":{"v":0,"d":"0.00"}},{"v":0,"d":"0.00"},{"v":0,"d":"0.00"},{"v":0,"d":"0.00"},{"v":0,"d":"0.00"},null,{"$f":"IF(AND(BU3=12,K34>0),IF(S34=1,BM34,BN34),0)","v":{"v":0,"d":"0.00"}},{"v":0,"d":"0.00"},{"v":0,"d":"0.00"},{"v":0,"d":"0.00"},{"v":0,"d":"0.00"}]
["Freitag","2023-01-27",{"$f":"'Einsatz 1'!C36","v":""},{"$f":"'Einsatz 1'!D36","v":0},{"$f":"'Einsatz 1'!E36","v":0},{"$f":"'Einsatz 1'!F36","v":0},{"$f":"'Einsatz 1'!G36","v":0},{"$f":"'Einsatz 1'!H36","v":"00:00:00"},null,null,"00:00:00",null,null,"00:00:00","00:00:00","21:00:00","06:00:00","",1,"00:00:00","00:00:00","00:00:00","00:00:00","00:00:00","00:00:00",{"v":0,"d":"0.00"},{"v":0,"d":"0.00"},{"v":0,"d":"0.00"},{"v":0,"d":"0.00"},{"v":0,"d":"0.00"},false,"00:00:00","00:00:00",{"v":0,"d":"0.00"},{"v":0,"d":"0.00"},{"v":0,"d":"0.00"},{"v":0,"d":"0.00"},{"v":0,"d":"0.00"},{"v":0,"d":"0.00"},{"v":0,"d":"0.00"},"00:00:00","00:00:00","00:00:00","00:00:00","00:00:00","00:00:00",{"v":0,"d":"0.00"},{"v":0,"d":"0.00"},"06:00:00","00:00:00",{"$nulls":16},{"v":0,"d":"0.00"},{"v":0,"d":"0.00"},{"v":0,"d":"0.00"},{"v":0,"d":"0.00"},null,null,{"v":0,"d":"0.00"},{"v":0,"d":"0.00"},{"v":0,"d":"0.00"},{"v":0,"d":"0.00"}]
["Samstag","2023-01-28",{"$f":"'Einsatz 1'!C37","v":""},{"$f":"'Einsatz 1'!D37","v":0},{"$f":"'Einsatz 1'!E37","v":0},{"$f":"'Einsatz 1'!F37","v":0},{"$f":"'Einsatz 1'!G37","v":0},{"$f":"'Einsatz 1'!H37","v":"00:00:00"},null,null,"00:00:00",null,null,"00:00:00","00:00:00","21:00:00","06:00:00","",1,"00:00:00","00:00:00","00:00:00","00:00:00","00:00:00","00:00:00",{"v":0,"d":"0.00"},{"v":0,"d":"0.00"},{"v":0,"d":"0.00"},{"v":0,"d":"0.00"},{"v":0,"d":"0.00"},false,"00:00:00","00:00:00",{"v":0,"d":"0.00"},{"v":0,"d":"0.00"},{"v":0,"d":"0.00"},{"v":0,"d":"0.00"},{"v":0,"d":"0.00"},{"v":0,"d":"0.00"},{"v":0,"d":"0.00"},"00:00:00","00:00:00","00:00:00","00:00:00","00:00:00","00:00:00",{"v":0,"d":"0.00"},{"v":0,"d":"0.00"},"06:00:00","00:00:00",{"$nulls":16},{"v":0,"d":"0.00"},{"v":0,"d":"0.00"},{"v":0,"d":"0.00"},{"v":0,"d":"0.00"},null,null,{"v":0,"d":"0.00"},{"v":0,"d":"0.00"},{"v":0,"d":"0.00"},{"v":0,"d":"0.00"}]
["Sonntag",{"$f":"IF(MONTH(B36+1)=BU3,B36+1,\"\")","v":"2023-01-29"},{"$f":"'Einsatz 1'!C38","v":""},{"$f":"'Einsatz 1'!D38","v":0},{"$f":"'Einsatz 1'!E38","v":0},{"$f":"'Einsatz 1'!F38","v":0},{"$f":"'Einsatz 1'!G38","v":0},{"$f":"'Einsatz 1'!H38","v":"00:00:00"},null,null,"00:00:00",null,null,"00:00:00","00:00:00","21:00:00","06:00:00","",1,"00:00:00","00:00:00","00:00:00","00:00:00","00:00:00","00:00:00",{"v":0,"d":"0.00"},{"v":0,"d":"0.00"},{"v":0,"d":"0.00"},{"v":0,"d":"0.00"},{"v":0,"d":"0.00"},false,"00:00:00","00:00:00",{"v":0,"d":"0.00"},{"v":0,"d":"0.00"},{"v":0,"d":"0.00"},{"v":0,"d":"0.00"},{"v":0,"d":"0.00"},{"v":0,"d":"0.00"},{"v":0,"d":"0.00"},"00:00:00","00:00:00","00:00:00","00:00:00","00:00:00","00:00:00",{"v":0,"d":"0.00"},{"v":0,"d":"0.00"},"06:00:00","00:00:00",{"$nulls":16},{"v":0,"d":"0.00"},{"v":0,"d":"0.00"},{"v":0,"d":"0.00"},{"v":0,"d":"0.00"},null,null,{"v":0,"d":"0.00"},{"v":0,"d":"0.00"},{"v":0,"d":"0.00"},{"v":0,"d":"0.00"}]
["Montag",{"$f":"IF(MONTH(B36+2)=BU3,B36+2,\"\")","v":"2023-01-30"},{"$f":"'Einsatz 1'!C39","v":""},{"$f":"'Einsatz 1'!D39","v":0},{"$f":"'Einsatz 1'!E39","v":0},{"$f":"'Einsatz 1'!F39","v":0},{"$f":"'Einsatz 1'!G39","v":0},{"$f":"'Einsatz 1'!H39","v":"00:00:00"},null,null,"00:00:00",null,null,"00:00:00","00:00:00","21:00:00","06:00:00","",1,"00:00:00","00:00:00","00:00:00","00:00:00","00:00:00","00:00:00",{"v":0,"d":"0.00"},{"v":0,"d":"0.00"},{"v":0,"d":"0.00"},{"v":0,"d":"0.00"},{"v":0,"d":"0.00"},false,"00:00:00","00:00:00",{"v":0,"d":"0.00"},{"v":0,"d":"0.00"},{"v":0,"d":"0.00"},{"v":0,"d":"0.00"},{"v":0,"d":"0.00"},{"v":0,"d":"0.00"},{"v":0,"d":"0.00"},"00:00:00","00:00:00","00:00:00","00:00:00","00:00:00","00:00:00",{"v":0,"d":"0.00"},{"v":0,"d":"0.00"},"06:00:00","00:00:00",{"$nulls":16},{"v":0,"d":"0.00"},{"v":0,"d":"0.00"},{"v":0,"d":"0.00"},{"v":0,"d":"0.00"},null,null,{"v":0,"d":"0.00"},{"v":0,"d":"0.00"},{"v":0,"d":"0.00"},{"v":0,"d":"0.00"}]
["Dienstag",{"$f":"IF(MONTH(B36+3)=BU3,B36+3,\"\")","v":"2023-01-31"},{"$f":"'Einsatz 1'!C40","v":""},{"$f":"'Einsatz 1'!D40","v":0},{"$f":"'Einsatz 1'!E40","v":0},{"$f":"'Einsatz 1'!F40","v":0},{"$f":"'Einsatz 1'!G40","v":0},{"$f":"'Einsatz 1'!H40","v":"00:00:00"},null,null,"00:00:00",null,null,"00:00:00","00:00:00","21:00:00","06:00:00","",1,"00:00:00","00:00:00","00:00:00","00:00:00","00:00:00","00:00:00",{"v":0,"d":"0.00"},{"v":0,"d":"0.00"},{"v":0,"d":"0.00"},{"v":0,"d":"0.00"},{"v":0,"d":"0.00"},false,"00:00:00","00:00:00",{"v":0,"d":"0.00"},{"v":0,"d":"0.00"},{"v":0,"d":"0.00"},{"v":0,"d":"0.00"},{"v":0,"d":"0.00"},{"v":0,"d":"0.00"},{"v":0,"d":"0.00"},"00:00:00","00:00:00","00:00:00","00:00:00","00:00:00","00:00:00",{"v":0,"d":"0.00"},{"v":0,"d":"0.00"},"06:00:00","00:00:00",{"$f":"IF(I39=\"\",0,IF(OR(I39>=AW39,I39<=AX39),1,IF(OR(J39>=AW39,J39<=AX39),1,IF(AND(I39<=TN39,J39>=AX39,J39<I39),1,0))))","v":0},{"$f":"(J39+$D$6)*24","v":{"v":0,"d":"0.00"}},{"v":24,"d":"24.00"},{"v":14,"d":"14.00"},{"$f":"IF(I39=\"\",0,IF(AY39,IF(AND((I39-$D$6)<=AW39,(I39-$D$6)>=AX39),AW39,IF(OR((I39-$D$6)>=AW39,(I39-$D$6)<=AX39),I39-$D$6,AW39)),0))","v":"00:00:00"},{"$f":"IF(OR(J39=\"\",AY39=0),0,IF(AY39=1,IF(AZ39>BA39,AX39,J39+$D$6)))","v":"00:00:00"},{"$f":"IF(I39=\"\",0,IF(AY39,IF(AND(I39<=AW39,I39>=AX39),AW39,IF(OR(I39>=AW39,I39<=AX39),I39,AW39)),0))","v":"00:00:00"},{"$f":"IF(OR(AY39=0,J39=0),0,IF(J39<=AX39,J39,IF(J39>=AW39,J39,AX39)))","v":"00:00:00"},{"$f":"IF(BE39=0,0,IF(BE39<=0.25,BD39-BC39,(BD39+1)-BC39))","v":"00:00:00"},{"$f":"IF(BE39=0,0,IF(BE39<=0.25,BF39-BE39,(BF39+1)-BE39))","v":"00:00:00"},{"$f":"BC39*24","v":{"v":0,"d":"0.00"}},{"$f":"BD39*24","v":{"v":0,"d":"0.00"}},{"$f":"BE39*24","v":{"v":0,"d":"0.00"}},{"$f":"BF39*24","v":{"v":0,"d":"0.00"}},{"$f":"IF(AND(I39>0,$BU$3=12,BI39<=BB39,S39=1),BJ39-BI39,0)","v":{"v":0,"d":"0.00"}},{"$f":"IF(AND(I39>0,BJ39>BB39,S39=1),IF(BI39-BB39<0,BG39*24-24-BM39,BI39-BB39),IF(BL39>BB39,BB39-BK39,0))","v":{"v":0,"d":"0.00"}},{"v":0,"d":"0.00"},{"v":0,"d":"0.00"},{"v":0,"d":"0.00"},{"v":0,"d":"0.00"},{"$f":"IF(OR($BU$3<12,I39=\"\"),0,BM39)","v":{"v":0,"d":"0.00"}},{"$f":"IF(AND($BU$3=12,BJ39<BB39,BJ39<=BA39),SUM(BJ39-IF(BI39-BB39>=0,BB39,BI39)),IF(AND($BU$3=12,BL39>14,BL39<=BA39),SUM(IF(BL39-14>0,BL39,14),0)))","v":false},{"v":0,"d":"0.00"},{"v":0,"d":"0.00"},{"v":0,"d":"0.00"},{"v":0,"d":"0.00"}]
[{"$nulls":10},{"$f":"SUM(K9:K39)","v":"00:00:00"},{"$nulls":55},{"$f":"SUM(BO9:BO39)","v":{"v":0,"d":"0.00"}},{"$f":"SUM(BP9:BP39)","v":{"v":0,"d":"0.00"}},{"v":0,"d":"0.00"},{"v":0,"d":"0.00"},{"v":0,"d":"0.00"},{"v":0,"d":"0.00"},{"v":0,"d":"0.00"},{"v":0,"d":"0.00"},{"v":0,"d":"0.00"},{"v":0,"d":"0.00"}]
[{"$nulls":3},{"$f":"'Einsatz 1'!D42","v":""},{"$f":"'Einsatz 1'!E42","v":""},{"$f":"'Einsatz 1'!F42","v":""},{"$f":"'Einsatz 1'!G42","v":""},{"$f":"'Einsatz 1'!H42","v":""},{"$nulls":58},{"$f":"IF(BO40=0,\"\",IF(BO40>0,SUM(BO9:BO39),\"\"))","v":""},{"$f":"IF(BP40=0,\"\",IF(BP40>0,SUM(BP9:BP39),\"\"))","v":""},{"$f":"IF(BQ40=0,\"\",IF(BQ40>0,SUM(BQ9:BQ39),\"\"))","v":""},{"$f":"IF(BR40=0,\"\",IF(BR40>0,SUM(BR9:BR39),\"\"))","v":""},{"$f":"IF(BS40=0,\"\",IF(BS40>0,SUM(BS9:BS39),\"\"))","v":""},"","","","",""]
[null,null,"* Es gelten nur die gesetzlichen Feiertage. Weihnachten und 1. Mai sind unter Lohnart 5071 gesondert berücksichtigt."]
[null,null,"** Auszuwählen ist an jedem Urlaubs- und/oder Krankheitstag jeweils \"ja\". "]
[null,null,"*** Auszuwählen ist \"ja\" nur an dem Tag, an dem die Rufbereitschaft begann."]
[null,null,"**** Bei Einsätzen, für die eine Vor-Ort-Anwensenheit nicht erforderlich war, bitte auf \"ja\" klicken. In diesem Fall wird bei der Berechnung keine Wegezeit berücksichtigt. ",{"$nulls":70},{"$f":"'Einsatz 1'!BV46","v":"Stand des Formulars: 01.02.2023"}]

{"sheet":"DRUCKEN - Alle Einsätze","index":3,"n_rows":85,"n_cols":31,"rows_kept":85,"merged":[[4,11,4,12],[53,3,53,9],[53,10,53,17],[53,18,53,25],[54,3,54,9],[54,10,54,17],[54,18,54,25],[55,3,55,9],[55,10,55,17],[55,18,55,25],[56,3,56,9],[56,10,56,17],[56,18,56,25],[57,3,57,9],[57,10,57,17],[57,18,57,25],[58,3,58,9],[58,10,58,17],[58,18,58,25],[59,3,59,9],[59,10,59,17],[59,18,59,25],[60,3,60,9],[60,10,60,17],[60,18,60,25],[61,3,61,9],[61,10,61,17],[61,18,61,25],[62,3,62,9],[62,10,62,17],[62,18,62,25],[63,3,63,9],[63,10,63,17],[63,18,63,25],[64,3,64,9],[64,10,64,17],[64,18,64,25],[65,3,65,9],[65,10,65,17],[65,18,65,25],[66,3,66,9],[66,10,66,17],[66,18,66,25],[67,3,67,9],[67,10,67,17],[67,18,67,25],[68,3,68,9],[68,10,68,17],[68,18,68,25],[69,3,69,9],[69,10,69,17],[69,18,69,25],[70,3,70,9],[70,10,70,17],[70,18,70,25],[71,3,71,9],[71,10,71,17],[71,18,71,25],[72,3,72,9],[72,10,72,17],[72,18,72,25],[73,3,73,9],[73,10,73,17],[73,18,73,25],[74,3,74,9],[74,10,74,17],[74,18,74,25],[75,3,75,9],[75,10,75,17],[75,18,75,25],[76,3,76,9],[76,10,76,17],[76,18,76,25],[77,3,77,9],[77,10,77,17],[77,18,77,25],[78,3,78,9],[78,10,78,17],[78,18,78,25],[79,3,79,9],[79,10,79,17],[79,18,79,25],[80,3,80,9],[80,10,80,17],[80,18,80,25],[81,3,81,9],[81,10,81,17],[81,18,81,25],[82,3,82,9],[82,10,82,17],[82,18,82,25],[83,3,83,9],[83,10,83,17],[83,18,83,25],[84,3,84,9],[84,10,84,17],[84,18,84,25],[85,3,85,9],[85,10,85,17],[85,18,85,25]]}
["Nachweis über Überstunden, Überstundenvergütung und Zeitzuschläge ",{"$nulls":24},"Datum:",{"$f":"TODAY()","v":"2023-02-01"}]
[]
[null,null,"Gesamtübersicht über Einsätze",{"$nulls":5},"Rufbereitschaft und Zeitzuschläge",{"$nulls":10},"Monat:",null,null,{"$f":"'Einsatz 1'!BU3","v":1},"Jahr:",{"$f":"'Einsatz 1'!BW3","v":2023}]
[]
[null,null,"Name, Vorname:",{"$f":"'Einsatz 1'!D5","v":0},{"$nulls":6},"Orga-Einheit:",{"$f":"'Einsatz 1'!L5","v":"Dezernat 5.3"},{"$nulls":10},"Freizeitausgleich wird gewährt:",{"$f":"'Einsatz 1'!BV5","v":"ja"}]
[null,null,"Übliche Wegezeit (h:mm):",{"$f":"'Einsatz 1'!D6","v":"00:00:00"},null,"Industriestunden:",{"$f":"D6*24","v":{"v":0,"d":"0.00"}},null,"1. Einsatz ",{"$nulls":6},"2. Einsatz ",{"$nulls":6},"3. Einsatz "]
["Tag","Datum","gesetzl. Feiertag in NRW*","Urlaub**","Krankheit (AU)**","Rufbereitschaft Mo-Fr 15:15 bis 07:00 des Folgetags***","Rufbereitschaft Sa, So, Feiertag (07:00 bis 07:00 des Folgetags)***","Rufbereitschaft       weniger als 12 Std.              (hh:mm)","Uhrzeit Einsatz von (hh:mm)","Uhrzeit Einsatz bis (hh:mm)","Arbeitszeit des Einsatzes (ohne Wegezeit)","Der Einsatz erfolgte ohne Präsenz (z.B. telefonisch)****","Grund des Einsatzes ","Einsatz mit WZ","Einsatz ohne WZ","Uhrzeit Einsatz von (hh:mm)","Uhrzeit Einsatz bis (hh:mm)","Arbeitszeit des Einsatzes (ohne Wegezeit)","Der Einsatz erfolgte ohne Präsenz (z.B. telefonisch)****","Grund des Einsatzes ","Einsatz mit WZ","Einsatz ohne WZ","Uhrzeit Einsatz von (hh:mm)","Uhrzeit Einsatz bis (hh:mm)","Arbeitszeit des Einsatzes (ohne Wegezeit)","Der Einsatz erfolgte ohne Präsenz (z.B. telefonisch)****","Grund des Einsatzes ","Einsatz mit WZ","Einsatz ohne WZ","Summe Einsätze mit WZ","Summe Einsätze ohne WZ"]
[{"$nulls":3},5167,5168,5200,5201,5204]
[{"$f":"TEXT(B9,\"TTTT\")","v":"Sonntag"},{"$f":"DATE(Y3,W3,1)","v":"2023-01-01"},{"$f":"'Einsatz 1'!C10","v":"Neujahr"},{"$f":"'Einsatz 1'!D10","v":0},{"$f":"'Einsatz 1'!E10","v":0},{"$f":"'Einsatz 1'!F10","v":0},{"$f":"'Einsatz 1'!G10","v":0},{"$f":"'Einsatz 1'!H10","v":"00:00:00"},{"$f":"IF('Einsatz 1'!I10=\"\",\"\",'Einsatz 1'!I10)","v":""},{"$f":"IF('Einsatz 1'!J10=\"\",\"\",'Einsatz 1'!J10)","v":""},{"$f":"IF(OR(I9=\"\",J9=\"\"),0,MOD(J9-I9,1))","v":"00:00:00"},{"$f":"IF('Einsatz 1'!L10=\"\",\"\",'Einsatz 1'!L10)","v":""},{"$f":"IF('Einsatz 1'!M10=\"\",\"\",'Einsatz 1'!M10)","v":""},{"$f":"IF(L9=\"ja\",0,IF(I9=\"\",0,ROUNDUP((K9+$D$6+$D$6)*24,0)))","v":{"v":0,"d":"0.00"}},{"$f":"IF(L9=\"\",0,K9*24)","v":{"v":0,"d":"0.00"}},{"$f":"IF('Einsatz 2'!I9=\"\",\"\",'Einsatz 2'!I9)","v":""},{"$f":"IF('Einsatz 2'!J9=\"\",\"\",'Einsatz 2'!J9)","v":""},{"$f":"IF(OR(P9=\"\",Q9=\"\"),0,MOD(Q9-P9,1))","v":"00:00:00"},{"$f":"IF('Einsatz 2'!L9=\"\",\"\",'Einsatz 2'!L9)","v":""},{"$f":"IF('Einsatz 2'!M9=\"\",\"\",'Einsatz 2'!M9)","v":""},{"$f":"IF(S9=\"ja\",0,IF(P9=\"\",0,ROUNDUP((R9+$D$6+$D$6)*24,0)))","v":{"v":0,"d":"0.00"}},{"$f":"IF(S9=\"\",0,R9*24)","v":{"v":0,"d":"0.00"}},{"$f":"IF('Einsatz 3'!I9=\"\",\"\",'Einsatz 3'!I9)","v":""},{"$f":"IF('Einsatz 3'!J9=\"\",\"\",'Einsatz 3'!J9)","v":""},{"$f":"IF(OR(W9=\"\",X9=\"\"),0,MOD(X9-W9,1))","v":"00:00:00"},{"$f":"IF('Einsatz 3'!L9=\"\",\"\",'Einsatz 3'!L9)","v":""},{"$f":"IF('Einsatz 3'!M9=\"\",\"\",'Einsatz 3'!M9)","v":""},{"$f":"IF(Z9=\"ja\",0,IF(W9=\"\",0,ROUNDUP((Y9+$D$6+$D$6)*24,0)))","v":{"v":0,"d":"0.00"}},{"$f":"IF(Z9=\"\",0,Y9*24)","v":{"v":0,"d":"0.00"}},{"$f":"N9+U9+AB9","v":{"v":0,"d":"0.00"}},{"$f":"ROUNDUP((O9+V9+AC9)/0.5,0)*0.5","v":{"v":0,"d":"0.00"}}]
[{"$f":"TEXT(B10,\"TTTT\")","v":"Montag"},{"$f":"B9+1","v":"2023-01-02"},{"$f":"'Einsatz 1'!C11","v":""},{"$f":"'Einsatz 1'!D11","v":0},{"$f":"'Einsatz 1'!E11","v":0},{"$f":"'Einsatz 1'!F11","v":0},{"$f":"'Einsatz 1'!G11","v":0},{"$f":"'Einsatz 1'!H11","v":"00:00:00"},{"$f":"IF('Einsatz 1'!I11=\"\",\"\",'Einsatz 1'!I11)","v":""},{"$f":"IF('Einsatz 1'!J11=\"\",\"\",'Einsatz 1'!J11)","v":""},{"$f":"IF(OR(I10=\"\",J10=\"\"),0,MOD(J10-I10,1))","v":"00:00:00"},{"$f":"IF('Einsatz 1'!L11=\"\",\"\",'Einsatz 1'!L11)","v":""},{"$f":"IF('Einsatz 1'!M11=\"\",\"\",'Einsatz 1'!M11)","v":""},{"$f":"IF(L10=\"ja\",0,IF(I10=\"\",0,ROUNDUP((K10+$D$6+$D$6)*24,0)))","v":{"v":0,"d":"0.00"}},{"$f":"IF(L10=\"\",0,K10*24)","v":{"v":0,"d":"0.00"}},{"$f":"IF('Einsatz 2'!I10=\"\",\"\",'Einsatz 2'!I10)","v":""},{"$f":"IF('Einsatz 2'!J10=\"\",\"\",'Einsatz 2'!J10)","v":""},{"$f":"IF(OR(P10=\"\",Q10=\"\"),0,MOD(Q10-P10,1))","v":"00:00:00"},{"$f":"IF('Einsatz 2'!L10=\"\",\"\",'Einsatz 2'!L10)","v":""},{"$f":"IF('Einsatz 2'!M10=\"\",\"\",'Einsatz 2'!M10)","v":""},{"$f":"IF(S10=\"ja\",0,IF(P10=\"\",0,ROUNDUP((R10+$D$6+$D$6)*24,0)))","v":{"v":0,"d":"0.00"}},{"$f":"IF(S10=\"\",0,R10*24)","v":{"v":0,"d":"0.00"}},{"$f":"IF('Einsatz 3'!I10=\"\",\"\",'Einsatz 3'!I10)","v":""},{"$f":"IF('Einsatz 3'!J10=\"\",\"\",'Einsatz 3'!J10)","v":""},{"$f":"IF(OR(W10=\"\",X10=\"\"),0,MOD(X10-W10,1))","v":"00:00:00"},{"$f":"IF('Einsatz 3'!L10=\"\",\"\",'Einsatz 3'!L10)","v":""},{"$f":"IF('Einsatz 3'!M10=\"\",\"\",'Einsatz 3'!M10)","v":""},{"$f":"IF(Z10=\"ja\",0,IF(W10=\"\",0,ROUNDUP((Y10+$D$6+$D$6)*24,0)))","v":{"v":0,"d":"0.00"}},{"$f":"IF(Z10=\"\",0,Y10*24)","v":{"v":0,"d":"0.00"}},{"$f":"N10+U10+AB10","v":{"v":0,"d":"0.00"}},{"$f":"ROUNDUP((O10+V10+AC10)/0.5,0)*0.5","v":{"v":0,"d":"0.00"}}]
["Dienstag",{"$f":"B10+1","v":"2023-01-03"},{"$f":"'Einsatz 1'!C12","v":""},{"$f":"'Einsatz 1'!D12","v":0},{"$f":"'Einsatz 1'!E12","v":0},{"$f":"'Einsatz 1'!F12","v":0},{"$f":"'Einsatz 1'!G12","v":0},{"$f":"'Einsatz 1'!H12","v":"00:00:00"},{"$f":"IF('Einsatz 1'!I12=\"\",\"\",'Einsatz 1'!I12)","v":""},{"$f":"IF('Einsatz 1'!J12=\"\",\"\",'Einsatz 1'!J12)","v":""},"00:00:00",{"$f":"IF('Einsatz 1'!L12=\"\",\"\",'Einsatz 1'!L12)","v":""},{"$f":"IF('Einsatz 1'!M12=\"\",\"\",'Einsatz 1'!M12)","v":""},{"v":0,"d":"0.00"},{"v":0,"d":"0.00"},{"$f":"IF('Einsatz 2'!I11=\"\",\"\",'Einsatz 2'!I11)","v":""},{"$f":"IF('Einsatz 2'!J11=\"\",\"\",'Einsatz 2'!J11)","v":""},"00:00:00",{"$f":"IF('Einsatz 2'!L11=\"\",\"\",'Einsatz 2'!L11)","v":""},{"$f":"IF('Einsatz 2'!M11=\"\",\"\",'Einsatz 2'!M11)","v":""},{"v":0,"d":"0.00"},{"v":0,"d":"0.00"},{"$f":"IF('Einsatz 3'!I11=\"\",\"\",'Einsatz 3'!I11)","v":""},{"$f":"IF('Einsatz 3'!J11=\"\",\"\",'Einsatz 3'!J11)","v":""},"00:00:00",{"$f":"IF('Einsatz 3'!L11=\"\",\"\",'Einsatz 3'!L11)","v":""},{"$f":"IF('Einsatz 3'!M11=\"\",\"\",'Einsatz 3'!M11)","v":""},{"v":0,"d":"0.00"},{"v":0,"d":"0.00"},{"v":0,"d":"0.00"},{"v":0,"d":"0.00"}]
["Mittwoch","2023-01-04",{"$f":"'Einsatz 1'!C13","v":""},{"$f":"'Einsatz 1'!D13","v":0},{"$f":"'Einsatz 1'!E13","v":0},{"$f":"'Einsatz 1'!F13","v":0},{"$f":"'Einsatz 1'!G13","v":0},{"$f":"'Einsatz 1'!H13","v":"00:00:00"},{"$f":"IF('Einsatz 1'!I13=\"\",\"\",'Einsatz 1'!I13)","v":""},{"$f":"IF('Einsatz 1'!J13=\"\",\"\",'Einsatz 1'!J13)","v":""},"00:00:00",{"$f":"IF('Einsatz 1'!L13=\"\",\"\",'Einsatz 1'!L13)","v":""},{"$f":"IF('Einsatz 1'!M13=\"\",\"\",'Einsatz 1'!M13)","v":""},{"v":0,"d":"0.00"},{"v":0,"d":"0.00"},{"$f":"IF('Einsatz 2'!I12=\"\",\"\",'Einsatz 2'!I12)","v":""},{"$f":"IF('Einsatz 2'!J12=\"\",\"\",'Einsatz 2'!J12)","v":""},"00:00:00",{"$f":"IF('Einsatz 2'!L12=\"\",\"\",'Einsatz 2'!L12)","v":""},{"$f":"IF('Einsatz 2'!M12=\"\",\"\",'Einsatz 2'!M12)","v":""},{"v":0,"d":"0.00"},{"v":0,"d":"0.00"},{"$f":"IF('Einsatz 3'!I12=\"\",\"\",'Einsatz 3'!I12)","v":""},{"$f":"IF('Einsatz 3'!J12=\"\",\"\",'Einsatz 3'!J12)","v":""},"00:00:00",{"$f":"IF('Einsatz 3'!L12=\"\",\"\",'Einsatz 3'!L12)","v":""},{"$f":"IF('Einsatz 3'!M12=\"\",\"\",'Einsatz 3'!M12)","v":""},{"v":0,"d":"0.00"},{"v":0,"d":"0.00"},{"v":0,"d":"0.00"},{"v":0,"d":"0.00"}]
["Donnerstag","2023-01-05",{"$f":"'Einsatz 1'!C14","v":""},{"$f":"'Einsatz 1'!D14","v":0},{"$f":"'Einsatz 1'!E14","v":0},{"$f":"'Einsatz 1'!F14","v":0},{"$f":"'Einsatz 1'!G14","v":0},{"$f":"'Einsatz 1'!H14","v":"00:00:00"},{"$f":"IF('Einsatz 1'!I14=\"\",\"\",'Einsatz 1'!I14)","v":""},{"$f":"IF('Einsatz 1'!J14=\"\",\"\",'Einsatz 1'!J14)","v":""},"00:00:00",{"$f":"IF('Einsatz 1'!L14=\"\",\"\",'Einsatz 1'!L14)","v":""},{"$f":"IF('Einsatz 1'!M14=\"\",\"\",'Einsatz 1'!M14)","v":""},{"v":0,"d":"0.00"},{"v":0,"d":"0.00"},{"$f":"IF('Einsatz 2'!I13=\"\",\"\",'Einsatz 2'!I13)","v":""},{"$f":"IF('Einsatz 2'!J13=\"\",\"\",'Einsatz 2'!J13)","v":""},"00:00:00",{"$f":"IF('Einsatz 2'!L13=\"\",\"\",'Einsatz 2'!L13)","v":""},{"$f":"IF('Einsatz 2'!M13=\"\",\"\",'Einsatz 2'!M13)","v":""},{"v":0,"d":"0.00"},{"v":0,"d":"0.00"},{"$f":"IF('Einsatz 3'!I13=\"\",\"\",'Einsatz 3'!I13)","v":""},{"$f":"IF('Einsatz 3'!J13=\"\",\"\",'Einsatz 3'!J13)","v":""},"00:00:00",{"$f":"IF('Einsatz 3'!L13=\"\",\"\",'Einsatz 3'!L13)","v":""},{"$f":"IF('Einsatz 3'!M13=\"\",\"\",'Einsatz 3'!M13)","v":""},{"v":0,"d":"0.00"},{"v":0,"d":"0.00"},{"v":0,"d":"0.00"},{"v":0,"d":"0.00"}]
["Freitag","2023-01-06",{"$f":"'Einsatz 1'!C15","v":""},{"$f":"'Einsatz 1'!D15","v":0},{"$f":"'Einsatz 1'!E15","v":0},{"$f":"'Einsatz 1'!F15","v":0},{"$f":"'Einsatz 1'!G15","v":0},{"$f":"'Einsatz 1'!H15","v":"00:00:00"},{"$f":"IF('Einsatz 1'!I15=\"\",\"\",'Einsatz 1'!I15)","v":""},{"$f":"IF('Einsatz 1'!J15=\"\",\"\",'Einsatz 1'!J15)","v":""},"00:00:00",{"$f":"IF('Einsatz 1'!L15=\"\",\"\",'Einsatz 1'!L15)","v":""},{"$f":"IF('Einsatz 1'!M15=\"\",\"\",'Einsatz 1'!M15)","v":""},{"v":0,"d":"0.00"},{"v":0,"d":"0.00"},{"$f":"IF('Einsatz 2'!I14=\"\",\"\",'Einsatz 2'!I14)","v":""},{"$f":"IF('Einsatz 2'!J14=\"\",\"\",'Einsatz 2'!J14)","v":""},"00:00:00",{"$f":"IF('Einsatz 2'!L14=\"\",\"\",'Einsatz 2'!L14)","v":""},{"$f":"IF('Einsatz 2'!M14=\"\",\"\",'Einsatz 2'!M14)","v":""},{"v":0,"d":"0.00"},{"v":0,"d":"0.00"},{"$f":"IF('Einsatz 3'!I14=\"\",\"\",'Einsatz 3'!I14)","v":""},{"$f":"IF('Einsatz 3'!J14=\"\",\"\",'Einsatz 3'!J14)","v":""},"00:00:00",{"$f":"IF('Einsatz 3'!L14=\"\",\"\",'Einsatz 3'!L14)","v":""},{"$f":"IF('Einsatz 3'!M14=\"\",\"\",'Einsatz 3'!M14)","v":""},{"v":0,"d":"0.00"},{"v":0,"d":"0.00"},{"v":0,"d":"0.00"},{"v":0,"d":"0.00"}]
["Samstag","2023-01-07",{"$f":"'Einsatz 1'!C16","v":""},{"$f":"'Einsatz 1'!D16","v":0},{"$f":"'Einsatz 1'!E16","v":0},{"$f":"'Einsatz 1'!F16","v":0},{"$f":"'Einsatz 1'!G16","v":0},{"$f":"'Einsatz 1'!H16","v":"00:00:00"},{"$f":"IF('Einsatz 1'!I16=\"\",\"\",'Einsatz 1'!I16)","v":""},{"$f":"IF('Einsatz 1'!J16=\"\",\"\",'Einsatz 1'!J16)","v":""},"00:00:00",{"$f":"IF('Einsatz 1'!L16=\"\",\"\",'Einsatz 1'!L16)","v":""},{"$f":"IF('Einsatz 1'!M16=\"\",\"\",'Einsatz 1'!M16)","v":""},{"v":0,"d":"0.00"},{"v":0,"d":"0.00"},{"$f":"IF('Einsatz 2'!I15=\"\",\"\",'Einsatz 2'!I15)","v":""},{"$f":"IF('Einsatz 2'!J15=\"\",\"\",'Einsatz 2'!J15)","v":""},"00:00:00",{"$f":"IF('Einsatz 2'!L15=\"\",\"\",'Einsatz 2'!L15)","v":""},{"$f":"IF('Einsatz 2'!M15=\"\",\"\",'Einsatz 2'!M15)","v":""},{"v":0,"d":"0.00"},{"v":0,"d":"0.00"},{"$f":"IF('Einsatz 3'!I15=\"\",\"\",'Einsatz 3'!I15)","v":""},{"$f":"IF('Einsatz 3'!J15=\"\",\"\",'Einsatz 3'!J15)","v":""},"00:00:00",{"$f":"IF('Einsatz 3'!L15=\"\",\"\",'Einsatz 3'!L15)","v":""},{"$f":"IF('Einsatz 3'!M15=\"\",\"\",'Einsatz 3'!M15)","v":""},{"v":0,"d":"0.00"},{"v":0,"d":"0.00"},{"v":0,"d":"0.00"},{"v":0,"d":"0.00"}]
["Sonntag","2023-01-08",{"$f":"'Einsatz 1'!C17","v":""},{"$f":"'Einsatz 1'!D17","v":0},{"$f":"'Einsatz 1'!E17","v":0},{"$f":"'Einsatz 1'!F17","v":0},{"$f":"'Einsatz 1'!G17","v":0},{"$f":"'Einsatz 1'!H17","v":"00:00:00"},{"$f":"IF('Einsatz 1'!I17=\"\",\"\",'Einsatz 1'!I17)","v":""},{"$f":"IF('Einsatz 1'!J17=\"\",\"\",'Einsatz 1'!J17)","v":""},"00:00:00",{"$f":"IF('Einsatz 1'!L17=\"\",\"\",'Einsatz 1'!L17)","v":""},{"$f":"IF('Einsatz 1'!M17=\"\",\"\",'Einsatz 1'!M17)","v":""},{"v":0,"d":"0.00"},{"v":0,"d":"0.00"},{"$f":"IF('Einsatz 2'!I16=\"\",\"\",'Einsatz 2'!I16)","v":""},{"$f":"IF('Einsatz 2'!J16=\"\",\"\",'Einsatz 2'!J16)","v":""},"00:00:00",{"$f":"IF('Einsatz 2'!L16=\"\",\"\",'Einsatz 2'!L16)","v":""},{"$f":"IF('Einsatz 2'!M16=\"\",\"\",'Einsatz 2'!M16)","v":""},{"v":0,"d":"0.00"},{"v":0,"d":"0.00"},{"$f":"IF('Einsatz 3'!I16=\"\",\"\",'Einsatz 3'!I16)","v":""},{"$f":"IF('Einsatz 3'!J16=\"\",\"\",'Einsatz 3'!J16)","v":""},"00:00:00",{"$f":"IF('Einsatz 3'!L16=\"\",\"\",'Einsatz 3'!L16)","v":""},{"$f":"IF('Einsatz 3'!M16=\"\",\"\",'Einsatz 3'!M16)","v":""},{"v":0,"d":"0.00"},{"v":0,"d":"0.00"},{"v":0,"d":"0.00"},{"v":0,"d":"0.00"}]
["Montag","2023-01-09",{"$f":"'Einsatz 1'!C18","v":""},{"$f":"'Einsatz 1'!D18","v":0},{"$f":"'Einsatz 1'!E18","v":0},{"$f":"'Einsatz 1'!F18","v":0},{"$f":"'Einsatz 1'!G18","v":0},{"$f":"'Einsatz 1'!H18","v":"00:00:00"},{"$f":"IF('Einsatz 1'!I18=\"\",\"\",'Einsatz 1'!I18)","v":""},{"$f":"IF('Einsatz 1'!J18=\"\",\"\",'Einsatz 1'!J18)","v":""},"00:00:00",{"$f":"IF('Einsatz 1'!L18=\"\",\"\",'Einsatz 1'!L18)","v":""},{"$f":"IF('Einsatz 1'!M18=\"\",\"\",'Einsatz 1'!M18)","v":""},{"v":0,"d":"0.00"},{"v":0,"d":"0.00"},{"$f":"IF('Einsatz 2'!I17=\"\",\"\",'Einsatz 2'!I17)","v":""},{"$f":"IF('Einsatz 2'!J17=\"\",\"\",'Einsatz 2'!J17)","v":""},"00:00:00",{"$f":"IF('Einsatz 2'!L17=\"\",\"\",'Einsatz 2'!L17)","v":""},{"$f":"IF('Einsatz 2'!M17=\"\",\"\",'Einsatz 2'!M17)","v":""},{"v":0,"d":"0.00"},{"v":0,"d":"0.00"},{"$f":"IF('Einsatz 3'!I17=\"\",\"\",'Einsatz 3'!I17)","v":""},{"$f":"IF('Einsatz 3'!J17=\"\",\"\",'Einsatz 3'!J17)","v":""},"00:00:00",{"$f":"IF('Einsatz 3'!L17=\"\",\"\",'Einsatz 3'!L17)","v":""},{"$f":"IF('Einsatz 3'!M17=\"\",\"\",'Einsatz 3'!M17)","v":""},{"v":0,"d":"0.00"},{"v":0,"d":"0.00"},{"v":0,"d":"0.00"},{"v":0,"d":"0.00"}]
["Dienstag","2023-01-10",{"$f":"'Einsatz 1'!C19","v":""},{"$f":"'Einsatz 1'!D19","v":0},{"$f":"'Einsatz 1'!E19","v":0},{"$f":"'Einsatz 1'!F19","v":0},{"$f":"'Einsatz 1'!G19","v":0},{"$f":"'Einsatz 1'!H19","v":"00:00:00"},{"$f":"IF('Einsatz 1'!I19=\"\",\"\",'Einsatz 1'!I19)","v":""},{"$f":"IF('Einsatz 1'!J19=\"\",\"\",'Einsatz 1'!J19)","v":""},"00:00:00",{"$f":"IF('Einsatz 1'!L19=\"\",\"\",'Einsatz 1'!L19)","v":""},{"$f":"IF('Einsatz 1'!M19=\"\",\"\",'Einsatz 1'!M19)","v":""},{"v":0,"d":"0.00"},{"v":0,"d":"0.00"},{"$f":"IF('Einsatz 2'!I18=\"\",\"\",'Einsatz 2'!I18)","v":""},{"$f":"IF('Einsatz 2'!J18=\"\",\"\",'Einsatz 2'!J18)","v":""},"00:00:00",{"$f":"IF('Einsatz 2'!L18=\"\",\"\",'Einsatz 2'!L18)","v":""},{"$f":"IF('Einsatz 2'!M18=\"\",\"\",'Einsatz 2'!M18)","v":""},{"v":0,"d":"0.00"},{"v":0,"d":"0.00"},{"$f":"IF('Einsatz 3'!I18=\"\",\"\",'Einsatz 3'!I18)","v":""},{"$f":"IF('Einsatz 3'!J18=\"\",\"\",'Einsatz 3'!J18)","v":""},"00:00:00",{"$f":"IF('Einsatz 3'!L18=\"\",\"\",'Einsatz 3'!L18)","v":""},{"$f":"IF('Einsatz 3'!M18=\"\",\"\",'Einsatz 3'!M18)","v":""},{"v":0,"d":"0.00"},{"v":0,"d":"0.00"},{"v":0,"d":"0.00"},{"v":0,"d":"0.00"}]
["Mittwoch","2023-01-11",{"$f":"'Einsatz 1'!C20","v":""},{"$f":"'Einsatz 1'!D20","v":0},{"$f":"'Einsatz 1'!E20","v":0},{"$f":"'Einsatz 1'!F20","v":0},{"$f":"'Einsatz 1'!G20","v":0},{"$f":"'Einsatz 1'!H20","v":"00:00:00"},{"$f":"IF('Einsatz 1'!I20=\"\",\"\",'Einsatz 1'!I20)","v":""},{"$f":"IF('Einsatz 1'!J20=\"\",\"\",'Einsatz 1'!J20)","v":""},"00:00:00",{"$f":"IF('Einsatz 1'!L20=\"\",\"\",'Einsatz 1'!L20)","v":""},{"$f":"IF('Einsatz 1'!M20=\"\",\"\",'Einsatz 1'!M20)","v":""},{"v":0,"d":"0.00"},{"v":0,"d":"0.00"},{"$f":"IF('Einsatz 2'!I19=\"\",\"\",'Einsatz 2'!I19)","v":""},{"$f":"IF('Einsatz 2'!J19=\"\",\"\",'Einsatz 2'!J19)","v":""},"00:00:00",{"$f":"IF('Einsatz 2'!L19=\"\",\"\",'Einsatz 2'!L19)","v":""},{"$f":"IF('Einsatz 2'!M19=\"\",\"\",'Einsatz 2'!M19)","v":""},{"v":0,"d":"0.00"},{"v":0,"d":"0.00"},{"$f":"IF('Einsatz 3'!I19=\"\",\"\",'Einsatz 3'!I19)","v":""},{"$f":"IF('Einsatz 3'!J19=\"\",\"\",'Einsatz 3'!J19)","v":""},"00:00:00",{"$f":"IF('Einsatz 3'!L19=\"\",\"\",'Einsatz 3'!L19)","v":""},{"$f":"IF('Einsatz 3'!M19=\"\",\"\",'Einsatz 3'!M19)","v":""},{"v":0,"d":"0.00"},{"v":0,"d":"0.00"},{"v":0,"d":"0.00"},{"v":0,"d":"0.00"}]
["Donnerstag","2023-01-12",{"$f":"'Einsatz 1'!C21","v":""},{"$f":"'Einsatz 1'!D21","v":0},{"$f":"'Einsatz 1'!E21","v":0},{"$f":"'Einsatz 1'!F21","v":0},{"$f":"'Einsatz 1'!G21","v":0},{"$f":"'Einsatz 1'!H21","v":"00:00:00"},{"$f":"IF('Einsatz 1'!I21=\"\",\"\",'Einsatz 1'!I21)","v":""},{"$f":"IF('Einsatz 1'!J21=\"\",\"\",'Einsatz 1'!J21)","v":""},"00:00:00",{"$f":"IF('Einsatz 1'!L21=\"\",\"\",'Einsatz 1'!L21)","v":""},{"$f":"IF('Einsatz 1'!M21=\"\",\"\",'Einsatz 1'!M21)","v":""},{"v":0,"d":"0.00"},{"v":0,"d":"0.00"},{"$f":"IF('Einsatz 2'!I20=\"\",\"\",'Einsatz 2'!I20)","v":""},{"$f":"IF('Einsatz 2'!J20=\"\",\"\",'Einsatz 2'!J20)","v":""},"00:00:00",{"$f":"IF('Einsatz 2'!L20=\"\",\"\",'Einsatz 2'!L20)","v":""},{"$f":"IF('Einsatz 2'!M20=\"\",\"\",'Einsatz 2'!M20)","v":""},{"v":0,"d":"0.00"},{"v":0,"d":"0.00"},{"$f":"IF('Einsatz 3'!I20=\"\",\"\",'Einsatz 3'!I20)","v":""},{"$f":"IF('Einsatz 3'!J20=\"\",\"\",'Einsatz 3'!J20)","v":""},"00:00:00",{"$f":"IF('Einsatz 3'!L20=\"\",\"\",'Einsatz 3'!L20)","v":""},{"$f":"IF('Einsatz 3'!M20=\"\",\"\",'Einsatz 3'!M20)","v":""},{"v":0,"d":"0.00"},{"v":0,"d":"0.00"},{"v":0,"d":"0.00"},{"v":0,"d":"0.00"}]
["Freitag","2023-01-13",{"$f":"'Einsatz 1'!C22","v":""},{"$f":"'Einsatz 1'!D22","v":0},{"$f":"'Einsatz 1'!E22","v":0},{"$f":"'Einsatz 1'!F22","v":0},{"$f":"'Einsatz 1'!G22","v":0},{"$f":"'Einsatz 1'!H22","v":"00:00:00"},{"$f":"IF('Einsatz 1'!I22=\"\",\"\",'Einsatz 1'!I22)","v":""},{"$f":"IF('Einsatz 1'!J22=\"\",\"\",'Einsatz 1'!J22)","v":""},"00:00:00",{"$f":"IF('Einsatz 1'!L22=\"\",\"\",'Einsatz 1'!L22)","v":""},{"$f":"IF('Einsatz 1'!M22=\"\",\"\",'Einsatz 1'!M22)","v":""},{"v":0,"d":"0.00"},{"v":0,"d":"0.00"},{"$f":"IF('Einsatz 2'!I21=\"\",\"\",'Einsatz 2'!I21)","v":""},{"$f":"IF('Einsatz 2'!J21=\"\",\"\",'Einsatz 2'!J21)","v":""},"00:00:00",{"$f":"IF('Einsatz 2'!L21=\"\",\"\",'Einsatz 2'!L21)","v":""},{"$f":"IF('Einsatz 2'!M21=\"\",\"\",'Einsatz 2'!M21)","v":""},{"v":0,"d":"0.00"},{"v":0,"d":"0.00"},{"$f":"IF('Einsatz 3'!I21=\"\",\"\",'Einsatz 3'!I21)","v":""},{"$f":"IF('Einsatz 3'!J21=\"\",\"\",'Einsatz 3'!J21)","v":""},"00:00:00",{"$f":"IF('Einsatz 3'!L21=\"\",\"\",'Einsatz 3'!L21)","v":""},{"$f":"IF('Einsatz 3'!M21=\"\",\"\",'Einsatz 3'!M21)","v":""},{"v":0,"d":"0.00"},{"v":0,"d":"0.00"},{"v":0,"d":"0.00"},{"v":0,"d":"0.00"}]
["Samstag","2023-01-14",{"$f":"'Einsatz 1'!C23","v":""},{"$f":"'Einsatz 1'!D23","v":0},{"$f":"'Einsatz 1'!E23","v":0},{"$f":"'Einsatz 1'!F23","v":0},{"$f":"'Einsatz 1'!G23","v":0},{"$f":"'Einsatz 1'!H23","v":"00:00:00"},{"$f":"IF('Einsatz 1'!I23=\"\",\"\",'Einsatz 1'!I23)","v":""},{"$f":"IF('Einsatz 1'!J23=\"\",\"\",'Einsatz 1'!J23)","v":""},"00:00:00",{"$f":"IF('Einsatz 1'!L23=\"\",\"\",'Einsatz 1'!L23)","v":""},{"$f":"IF('Einsatz 1'!M23=\"\",\"\",'Einsatz 1'!M23)","v":""},{"v":0,"d":"0.00"},{"v":0,"d":"0.00"},{"$f":"IF('Einsatz 2'!I22=\"\",\"\",'Einsatz 2'!I22)","v":""},{"$f":"IF('Einsatz 2'!J22=\"\",\"\",'Einsatz 2'!J22)","v":""},"00:00:00",{"$f":"IF('Einsatz 2'!L22=\"\",\"\",'Einsatz 2'!L22)","v":""},{"$f":"IF('Einsatz 2'!M22=\"\",\"\",'Einsatz 2'!M22)","v":""},{"v":0,"d":"0.00"},{"v":0,"d":"0.00"},{"$f":"IF('Einsatz 3'!I22=\"\",\"\",'Einsatz 3'!I22)","v":""},{"$f":"IF('Einsatz 3'!J22=\"\",\"\",'Einsatz 3'!J22)","v":""},"00:00:00",{"$f":"IF('Einsatz 3'!L22=\"\",\"\",'Einsatz 3'!L22)","v":""},{"$f":"IF('Einsatz 3'!M22=\"\",\"\",'Einsatz 3'!M22)","v":""},{"v":0,"d":"0.00"},{"v":0,"d":"0.00"},{"v":0,"d":"0.00"},{"v":0,"d":"0.00"}]
["Sonntag","2023-01-15",{"$f":"'Einsatz 1'!C24","v":""},{"$f":"'Einsatz 1'!D24","v":0},{"$f":"'Einsatz 1'!E24","v":0},{"$f":"'Einsatz 1'!F24","v":0},{"$f":"'Einsatz 1'!G24","v":0},{"$f":"'Einsatz 1'!H24","v":"00:00:00"},{"$f":"IF('Einsatz 1'!I24=\"\",\"\",'Einsatz 1'!I24)","v":""},{"$f":"IF('Einsatz 1'!J24=\"\",\"\",'Einsatz 1'!J24)","v":""},"00:00:00",{"$f":"IF('Einsatz 1'!L24=\"\",\"\",'Einsatz 1'!L24)","v":""},{"$f":"IF('Einsatz 1'!M24=\"\",\"\",'Einsatz 1'!M24)","v":""},{"v":0,"d":"0.00"},{"v":0,"d":"0.00"},{"$f":"IF('Einsatz 2'!I23=\"\",\"\",'Einsatz 2'!I23)","v":""},{"$f":"IF('Einsatz 2'!J23=\"\",\"\",'Einsatz 2'!J23)","v":""},"00:00:00",{"$f":"IF('Einsatz 2'!L23=\"\",\"\",'Einsatz 2'!L23)","v":""},{"$f":"IF('Einsatz 2'!M23=\"\",\"\",'Einsatz 2'!M23)","v":""},{"v":0,"d":"0.00"},{"v":0,"d":"0.00"},{"$f":"IF('Einsatz 3'!I23=\"\",\"\",'Einsatz 3'!I23)","v":""},{"$f":"IF('Einsatz 3'!J23=\"\",\"\",'Einsatz 3'!J23)","v":""},"00:00:00",{"$f":"IF('Einsatz 3'!L23=\"\",\"\",'Einsatz 3'!L23)","v":""},{"$f":"IF('Einsatz 3'!M23=\"\",\"\",'Einsatz 3'!M23)","v":""},{"v":0,"d":"0.00"},{"v":0,"d":"0.00"},{"v":0,"d":"0.00"},{"v":0,"d":"0.00"}]
["Montag","2023-01-16",{"$f":"'Einsatz 1'!C25","v":""},{"$f":"'Einsatz 1'!D25","v":0},{"$f":"'Einsatz 1'!E25","v":0},{"$f":"'Einsatz 1'!F25","v":0},{"$f":"'Einsatz 1'!G25","v":0},{"$f":"'Einsatz 1'!H25","v":"00:00:00"},{"$f":"IF('Einsatz 1'!I25=\"\",\"\",'Einsatz 1'!I25)","v":""},{"$f":"IF('Einsatz 1'!J25=\"\",\"\",'Einsatz 1'!J25)","v":""},"00:00:00",{"$f":"IF('Einsatz 1'!L25=\"\",\"\",'Einsatz 1'!L25)","v":""},{"$f":"IF('Einsatz 1'!M25=\"\",\"\",'Einsatz 1'!M25)","v":""},{"v":0,"d":"0.00"},{"v":0,"d":"0.00"},{"$f":"IF('Einsatz 2'!I24=\"\",\"\",'Einsatz 2'!I24)","v":""},{"$f":"IF('Einsatz 2'!J24=\"\",\"\",'Einsatz 2'!J24)","v":""},"00:00:00",{"$f":"IF('Einsatz 2'!L24=\"\",\"\",'Einsatz 2'!L24)","v":""},{"$f":"IF('Einsatz 2'!M24=\"\",\"\",'Einsatz 2'!M24)","v":""},{"v":0,"d":"0.00"},{"v":0,"d":"0.00"},{"$f":"IF('Einsatz 3'!I24=\"\",\"\",'Einsatz 3'!I24)","v":""},{"$f":"IF('Einsatz 3'!J24=\"\",\"\",'Einsatz 3'!J24)","v":""},"00:00:00",{"$f":"IF('Einsatz 3'!L24=\"\",\"\",'Einsatz 3'!L24)","v":""},{"$f":"IF('Einsatz 3'!M24=\"\",\"\",'Einsatz 3'!M24)","v":""},{"v":0,"d":"0.00"},{"v":0,"d":"0.00"},{"v":0,"d":"0.00"},{"v":0,"d":"0.00"}]
["Dienstag","2023-01-17",{"$f":"'Einsatz 1'!C26","v":""},{"$f":"'Einsatz 1'!D26","v":0},{"$f":"'Einsatz 1'!E26","v":0},{"$f":"'Einsatz 1'!F26","v":0},{"$f":"'Einsatz 1'!G26","v":0},{"$f":"'Einsatz 1'!H26","v":"00:00:00"},{"$f":"IF('Einsatz 1'!I26=\"\",\"\",'Einsatz 1'!I26)","v":""},{"$f":"IF('Einsatz 1'!J26=\"\",\"\",'Einsatz 1'!J26)","v":""},"00:00:00",{"$f":"IF('Einsatz 1'!L26=\"\",\"\",'Einsatz 1'!L26)","v":""},{"$f":"IF('Einsatz 1'!M26=\"\",\"\",'Einsatz 1'!M26)","v":""},{"v":0,"d":"0.00"},{"v":0,"d":"0.00"},{"$f":"IF('Einsatz 2'!I25=\"\",\"\",'Einsatz 2'!I25)","v":""},{"$f":"IF('Einsatz 2'!J25=\"\",\"\",'Einsatz 2'!J25)","v":""},"00:00:00",{"$f":"IF('Einsatz 2'!L25=\"\",\"\",'Einsatz 2'!L25)","v":""},{"$f":"IF('Einsatz 2'!M25=\"\",\"\",'Einsatz 2'!M25)","v":""},{"v":0,"d":"0.00"},{"v":0,"d":"0.00"},{"$f":"IF('Einsatz 3'!I25=\"\",\"\",'Einsatz 3'!I25)","v":""},{"$f":"IF('Einsatz 3'!J25=\"\",\"\",'Einsatz 3'!J25)","v":""},"00:00:00",{"$f":"IF('Einsatz 3'!L25=\"\",\"\",'Einsatz 3'!L25)","v":""},{"$f":"IF('Einsatz 3'!M25=\"\",\"\",'Einsatz 3'!M25)","v":""},{"v":0,"d":"0.00"},{"v":0,"d":"0.00"},{"v":0,"d":"0.00"},{"v":0,"d":"0.00"}]
["Mittwoch","2023-01-18",{"$f":"'Einsatz 1'!C27","v":""},{"$f":"'Einsatz 1'!D27","v":0},{"$f":"'Einsatz 1'!E27","v":0},{"$f":"'Einsatz 1'!F27","v":0},{"$f":"'Einsatz 1'!G27","v":0},{"$f":"'Einsatz 1'!H27","v":"00:00:00"},{"$f":"IF('Einsatz 1'!I27=\"\",\"\",'Einsatz 1'!I27)","v":""},{"$f":"IF('Einsatz 1'!J27=\"\",\"\",'Einsatz 1'!J27)","v":""},"00:00:00",{"$f":"IF('Einsatz 1'!L27=\"\",\"\",'Einsatz 1'!L27)","v":""},{"$f":"IF('Einsatz 1'!M27=\"\",\"\",'Einsatz 1'!M27)","v":""},{"v":0,"d":"0.00"},{"v":0,"d":"0.00"},{"$f":"IF('Einsatz 2'!I26=\"\",\"\",'Einsatz 2'!I26)","v":""},{"$f":"IF('Einsatz 2'!J26=\"\",\"\",'Einsatz 2'!J26)","v":""},"00:00:00",{"$f":"IF('Einsatz 2'!L26=\"\",\"\",'Einsatz 2'!L26)","v":""},{"$f":"IF('Einsatz 2'!M26=\"\",\"\",'Einsatz 2'!M26)","v":""},{"v":0,"d":"0.00"},{"v":0,"d":"0.00"},{"$f":"IF('Einsatz 3'!I26=\"\",\"\",'Einsatz 3'!I26)","v":""},{"$f":"IF('Einsatz 3'!J26=\"\",\"\",'Einsatz 3'!J26)","v":""},"00:00:00",{"$f":"IF('Einsatz 3'!L26=\"\",\"\",'Einsatz 3'!L26)","v":""},{"$f":"IF('Einsatz 3'!M26=\"\",\"\",'Einsatz 3'!M26)","v":""},{"v":0,"d":"0.00"},{"v":0,"d":"0.00"},{"v":0,"d":"0.00"},{"v":0,"d":"0.00"}]
["Donnerstag","2023-01-19",{"$f":"'Einsatz 1'!C28","v":""},{"$f":"'Einsatz 1'!D28","v":0},{"$f":"'Einsatz 1'!E28","v":0},{"$f":"'Einsatz 1'!F28","v":0},{"$f":"'Einsatz 1'!G28","v":0},{"$f":"'Einsatz 1'!H28","v":"00:00:00"},{"$f":"IF('Einsatz 1'!I28=\"\",\"\",'Einsatz 1'!I28)","v":""},{"$f":"IF('Einsatz 1'!J28=\"\",\"\",'Einsatz 1'!J28)","v":""},"00:00:00",{"$f":"IF('Einsatz 1'!L28=\"\",\"\",'Einsatz 1'!L28)","v":""},{"$f":"IF('Einsatz 1'!M28=\"\",\"\",'Einsatz 1'!M28)","v":""},{"v":0,"d":"0.00"},{"v":0,"d":"0.00"},{"$f":"IF('Einsatz 2'!I27=\"\",\"\",'Einsatz 2'!I27)","v":""},{"$f":"IF('Einsatz 2'!J27=\"\",\"\",'Einsatz 2'!J27)","v":""},"00:00:00",{"$f":"IF('Einsatz 2'!L27=\"\",\"\",'Einsatz 2'!L27)","v":""},{"$f":"IF('Einsatz 2'!M27=\"\",\"\",'Einsatz 2'!M27)","v":""},{"v":0,"d":"0.00"},{"v":0,"d":"0.00"},{"$f":"IF('Einsatz 3'!I27=\"\",\"\",'Einsatz 3'!I27)","v":""},{"$f":"IF('Einsatz 3'!J27=\"\",\"\",'Einsatz 3'!J27)","v":""},"00:00:00",{"$f":"IF('Einsatz 3'!L27=\"\",\"\",'Einsatz 3'!L27)","v":""},{"$f":"IF('Einsatz 3'!M27=\"\",\"\",'Einsatz 3'!M27)","v":""},{"v":0,"d":"0.00"},{"v":0,"d":"0.00"},{"v":0,"d":"0.00"},{"v":0,"d":"0.00"}]
["Freitag","2023-01-20",{"$f":"'Einsatz 1'!C29","v":""},{"$f":"'Einsatz 1'!D29","v":0},{"$f":"'Einsatz 1'!E29","v":0},{"$f":"'Einsatz 1'!F29","v":0},{"$f":"'Einsatz 1'!G29","v":0},{"$f":"'Einsatz 1'!H29","v":"00:00:00"},{"$f":"IF('Einsatz 1'!I29=\"\",\"\",'Einsatz 1'!I29)","v":""},{"$f":"IF('Einsatz 1'!J29=\"\",\"\",'Einsatz 1'!J29)","v":""},"00:00:00",{"$f":"IF('Einsatz 1'!L29=\"\",\"\",'Einsatz 1'!L29)","v":""},{"$f":"IF('Einsatz 1'!M29=\"\",\"\",'Einsatz 1'!M29)","v":""},{"v":0,"d":"0.00"},{"v":0,"d":"0.00"},{"$f":"IF('Einsatz 2'!I28=\"\",\"\",'Einsatz 2'!I28)","v":""},{"$f":"IF('Einsatz 2'!J28=\"\",\"\",'Einsatz 2'!J28)","v":""},"00:00:00",{"$f":"IF('Einsatz 2'!L28=\"\",\"\",'Einsatz 2'!L28)","v":""},{"$f":"IF('Einsatz 2'!M28=\"\",\"\",'Einsatz 2'!M28)","v":""},{"v":0,"d":"0.00"},{"v":0,"d":"0.00"},{"$f":"IF('Einsatz 3'!I28=\"\",\"\",'Einsatz 3'!I28)","v":""},{"$f":"IF('Einsatz 3'!J28=\"\",\"\",'Einsatz 3'!J28)","v":""},"00:00:00",{"$f":"IF('Einsatz 3'!L28=\"\",\"\",'Einsatz 3'!L28)","v":""},{"$f":"IF('Einsatz 3'!M28=\"\",\"\",'Einsatz 3'!M28)","v":""},{"v":0,"d":"0.00"},{"v":0,"d":"0.00"},{"v":0,"d":"0.00"},{"v":0,"d":"0.00"}]
["Samstag","2023-01-21",{"$f":"'Einsatz 1'!C30","v":""},{"$f":"'Einsatz 1'!D30","v":0},{"$f":"'Einsatz 1'!E30","v":0},{"$f":"'Einsatz 1'!F30","v":0},{"$f":"'Einsatz 1'!G30","v":0},{"$f":"'Einsatz 1'!H30","v":"00:00:00"},{"$f":"IF('Einsatz 1'!I30=\"\",\"\",'Einsatz 1'!I30)","v":""},{"$f":"IF('Einsatz 1'!J30=\"\",\"\",'Einsatz 1'!J30)","v":""},"00:00:00",{"$f":"IF('Einsatz 1'!L30=\"\",\"\",'Einsatz 1'!L30)","v":""},{"$f":"IF('Einsatz 1'!M30=\"\",\"\",'Einsatz 1'!M30)","v":""},{"v":0,"d":"0.00"},{"v":0,"d":"0.00"},{"$f":"IF('Einsatz 2'!I29=\"\",\"\",'Einsatz 2'!I29)","v":""},{"$f":"IF('Einsatz 2'!J29=\"\",\"\",'Einsatz 2'!J29)","v":""},"00:00:00",{"$f":"IF('Einsatz 2'!L29=\"\",\"\",'Einsatz 2'!L29)","v":""},{"$f":"IF('Einsatz 2'!M29=\"\",\"\",'Einsatz 2'!M29)","v":""},{"v":0,"d":"0.00"},{"v":0,"d":"0.00"},{"$f":"IF('Einsatz 3'!I29=\"\",\"\",'Einsatz 3'!I29)","v":""},{"$f":"IF('Einsatz 3'!J29=\"\",\"\",'Einsatz 3'!J29)","v":""},"00:00:00",{"$f":"IF('Einsatz 3'!L29=\"\",\"\",'Einsatz 3'!L29)","v":""},{"$f":"IF('Einsatz 3'!M29=\"\",\"\",'Einsatz 3'!M29)","v":""},{"v":0,"d":"0.00"},{"v":0,"d":"0.00"},{"v":0,"d":"0.00"},{"v":0,"d":"0.00"}]
["Sonntag","2023-01-22",{"$f":"'Einsatz 1'!C31","v":""},{"$f":"'Einsatz 1'!D31","v":0},{"$f":"'Einsatz 1'!E31","v":0},{"$f":"'Einsatz 1'!F31","v":0},{"$f":"'Einsatz 1'!G31","v":0},{"$f":"'Einsatz 1'!H31","v":"00:00:00"},{"$f":"IF('Einsatz 1'!I31=\"\",\"\",'Einsatz 1'!I31)","v":""},{"$f":"IF('Einsatz 1'!J31=\"\",\"\",'Einsatz 1'!J31)","v":""},"00:00:00",{"$f":"IF('Einsatz 1'!L31=\"\",\"\",'Einsatz 1'!L31)","v":""},{"$f":"IF('Einsatz 1'!M31=\"\",\"\",'Einsatz 1'!M31)","v":""},{"v":0,"d":"0.00"},{"v":0,"d":"0.00"},{"$f":"IF('Einsatz 2'!I30=\"\",\"\",'Einsatz 2'!I30)","v":""},{"$f":"IF('Einsatz 2'!J30=\"\",\"\",'Einsatz 2'!J30)","v":""},"00:00:00",{"$f":"IF('Einsatz 2'!L30=\"\",\"\",'Einsatz 2'!L30)","v":""},{"$f":"IF('Einsatz 2'!M30=\"\",\"\",'Einsatz 2'!M30)","v":""},{"v":0,"d":"0.00"},{"v":0,"d":"0.00"},{"$f":"IF('Einsatz 3'!I30=\"\",\"\",'Einsatz 3'!I30)","v":""},{"$f":"IF('Einsatz 3'!J30=\"\",\"\",'Einsatz 3'!J30)","v":""},"00:00:00",{"$f":"IF('Einsatz 3'!L30=\"\",\"\",'Einsatz 3'!L30)","v":""},{"$f":"IF('Einsatz 3'!M30=\"\",\"\",'Einsatz 3'!M30)","v":""},{"v":0,"d":"0.00"},{"v":0,"d":"0.00"},{"v":0,"d":"0.00"},{"v":0,"d":"0.00"}]
["Montag","2023-01-23",{"$f":"'Einsatz 1'!C32","v":""},{"$f":"'Einsatz 1'!D32","v":0},{"$f":"'Einsatz 1'!E32","v":0},{"$f":"'Einsatz 1'!F32","v":0},{"$f":"'Einsatz 1'!G32","v":0},{"$f":"'Einsatz 1'!H32","v":"00:00:00"},{"$f":"IF('Einsatz 1'!I32=\"\",\"\",'Einsatz 1'!I32)","v":""},{"$f":"IF('Einsatz 1'!J32=\"\",\"\",'Einsatz 1'!J32)","v":""},"00:00:00",{"$f":"IF('Einsatz 1'!L32=\"\",\"\",'Einsatz 1'!L32)","v":""},{"$f":"IF('Einsatz 1'!M32=\"\",\"\",'Einsatz 1'!M32)","v":""},{"v":0,"d":"0.00"},{"v":0,"d":"0.00"},{"$f":"IF('Einsatz 2'!I31=\"\",\"\",'Einsatz 2'!I31)","v":""},{"$f":"IF('Einsatz 2'!J31=\"\",\"\",'Einsatz 2'!J31)","v":""},"00:00:00",{"$f":"IF('Einsatz 2'!L31=\"\",\"\",'Einsatz 2'!L31)","v":""},{"$f":"IF('Einsatz 2'!M31=\"\",\"\",'Einsatz 2'!M31)","v":""},{"v":0,"d":"0.00"},{"v":0,"d":"0.00"},{"$f":"IF('Einsatz 3'!I31=\"\",\"\",'Einsatz 3'!I31)","v":""},{"$f":"IF('Einsatz 3'!J31=\"\",\"\",'Einsatz 3'!J31)","v":""},"00:00:00",{"$f":"IF('Einsatz 3'!L31=\"\",\"\",'Einsatz 3'!L31)","v":""},{"$f":"IF('Einsatz 3'!M31=\"\",\"\",'Einsatz 3'!M31)","v":""},{"v":0,"d":"0.00"},{"v":0,"d":"0.00"},{"v":0,"d":"0.00"},{"v":0,"d":"0.00"}]
["Dienstag","2023-01-24",{"$f":"'Einsatz 1'!C33","v":""},{"$f":"'Einsatz 1'!D33","v":0},{"$f":"'Einsatz 1'!E33","v":0},{"$f":"'Einsatz 1'!F33","v":0},{"$f":"'Einsatz 1'!G33","v":0},{"$f":"'Einsatz 1'!H33","v":"00:00:00"},{"$f":"IF('Einsatz 1'!I33=\"\",\"\",'Einsatz 1'!I33)","v":""},{"$f":"IF('Einsatz 1'!J33=\"\",\"\",'Einsatz 1'!J33)","v":""},"00:00:00",{"$f":"IF('Einsatz 1'!L33=\"\",\"\",'Einsatz 1'!L33)","v":""},{"$f":"IF('Einsatz 1'!M33=\"\",\"\",'Einsatz 1'!M33)","v":""},{"v":0,"d":"0.00"},{"v":0,"d":"0.00"},{"$f":"IF('Einsatz 2'!I32=\"\",\"\",'Einsatz 2'!I32)","v":""},{"$f":"IF('Einsatz 2'!J32=\"\",\"\",'Einsatz 2'!J32)","v":""},"00:00:00",{"$f":"IF('Einsatz 2'!L32=\"\",\"\",'Einsatz 2'!L32)","v":""},{"$f":"IF('Einsatz 2'!M32=\"\",\"\",'Einsatz 2'!M32)","v":""},{"v":0,"d":"0.00"},{"v":0,"d":"0.00"},{"$f":"IF('Einsatz 3'!I32=\"\",\"\",'Einsatz 3'!I32)","v":""},{"$f":"IF('Einsatz 3'!J32=\"\",\"\",'Einsatz 3'!J32)","v":""},"00:00:00",{"$f":"IF('Einsatz 3'!L32=\"\",\"\",'Einsatz 3'!L32)","v":""},{"$f":"IF('Einsatz 3'!M32=\"\",\"\",'Einsatz 3'!M32)","v":""},{"v":0,"d":"0.00"},{"v":0,"d":"0.00"},{"v":0,"d":"0.00"},{"v":0,"d":"0.00"}]
["Mittwoch","2023-01-25",{"$f":"'Einsatz 1'!C34","v":""},{"$f":"'Einsatz 1'!D34","v":0},{"$f":"'Einsatz 1'!E34","v":0},{"$f":"'Einsatz 1'!F34","v":0},{"$f":"'Einsatz 1'!G34","v":0},{"$f":"'Einsatz 1'!H34","v":"00:00:00"},{"$f":"IF('Einsatz 1'!I34=\"\",\"\",'Einsatz 1'!I34)","v":""},{"$f":"IF('Einsatz 1'!J34=\"\",\"\",'Einsatz 1'!J34)","v":""},"00:00:00",{"$f":"IF('Einsatz 1'!L34=\"\",\"\",'Einsatz 1'!L34)","v":""},{"$f":"IF('Einsatz 1'!M34=\"\",\"\",'Einsatz 1'!M34)","v":""},{"v":0,"d":"0.00"},{"v":0,"d":"0.00"},{"$f":"IF('Einsatz 2'!I33=\"\",\"\",'Einsatz 2'!I33)","v":""},{"$f":"IF('Einsatz 2'!J33=\"\",\"\",'Einsatz 2'!J33)","v":""},"00:00:00",{"$f":"IF('Einsatz 2'!L33=\"\",\"\",'Einsatz 2'!L33)","v":""},{"$f":"IF('Einsatz 2'!M33=\"\",\"\",'Einsatz 2'!M33)","v":""},{"v":0,"d":"0.00"},{"v":0,"d":"0.00"},{"$f":"IF('Einsatz 3'!I33=\"\",\"\",'Einsatz 3'!I33)","v":""},{"$f":"IF('Einsatz 3'!J33=\"\",\"\",'Einsatz 3'!J33)","v":""},"00:00:00",{"$f":"IF('Einsatz 3'!L33=\"\",\"\",'Einsatz 3'!L33)","v":""},{"$f":"IF('Einsatz 3'!M33=\"\",\"\",'Einsatz 3'!M33)","v":""},{"v":0,"d":"0.00"},{"v":0,"d":"0.00"},{"v":0,"d":"0.00"},{"v":0,"d":"0.00"}]
["Donnerstag","2023-01-26",{"$f":"'Einsatz 1'!C35","v":""},{"$f":"'Einsatz 1'!D35","v":0},{"$f":"'Einsatz 1'!E35","v":0},{"$f":"'Einsatz 1'!F35","v":0},{"$f":"'Einsatz 1'!G35","v":0},{"$f":"'Einsatz 1'!H35","v":"00:00:00"},{"$f":"IF('Einsatz 1'!I35=\"\",\"\",'Einsatz 1'!I35)","v":""},{"$f":"IF('Einsatz 1'!J35=\"\",\"\",'Einsatz 1'!J35)","v":""},"00:00:00",{"$f":"IF('Einsatz 1'!L35=\"\",\"\",'Einsatz 1'!L35)","v":""},{"$f":"IF('Einsatz 1'!M35=\"\",\"\",'Einsatz 1'!M35)","v":""},{"v":0,"d":"0.00"},{"v":0,"d":"0.00"},{"$f":"IF('Einsatz 2'!I34=\"\",\"\",'Einsatz 2'!I34)","v":""},{"$f":"IF('Einsatz 2'!J34=\"\",\"\",'Einsatz 2'!J34)","v":""},"00:00:00",{"$f":"IF('Einsatz 2'!L34=\"\",\"\",'Einsatz 2'!L34)","v":""},{"$f":"IF('Einsatz 2'!M34=\"\",\"\",'Einsatz 2'!M34)","v":""},{"v":0,"d":"0.00"},{"v":0,"d":"0.00"},{"$f":"IF('Einsatz 3'!I34=\"\",\"\",'Einsatz 3'!I34)","v":""},{"$f":"IF('Einsatz 3'!J34=\"\",\"\",'Einsatz 3'!J34)","v":""},"00:00:00",{"$f":"IF('Einsatz 3'!L34=\"\",\"\",'Einsatz 3'!L34)","v":""},{"$f":"IF('Einsatz 3'!M34=\"\",\"\",'Einsatz 3'!M34)","v":""},{"v":0,"d":"0.00"},{"v":0,"d":"0.00"},{"v":0,"d":"0.00"},{"v":0,"d":"0.00"}]
["Freitag","2023-01-27",{"$f":"'Einsatz 1'!C36","v":""},{"$f":"'Einsatz 1'!D36","v":0},{"$f":"'Einsatz 1'!E36","v":0},{"$f":"'Einsatz 1'!F36","v":0},{"$f":"'Einsatz 1'!G36","v":0},{"$f":"'Einsatz 1'!H36","v":"00:00:00"},{"$f":"IF('Einsatz 1'!I36=\"\",\"\",'Einsatz 1'!I36)","v":""},{"$f":"IF('Einsatz 1'!J36=\"\",\"\",'Einsatz 1'!J36)","v":""},"00:00:00",{"$f":"IF('Einsatz 1'!L36=\"\",\"\",'Einsatz 1'!L36)","v":""},{"$f":"IF('Einsatz 1'!M36=\"\",\"\",'Einsatz 1'!M36)","v":""},{"v":0,"d":"0.00"},{"v":0,"d":"0.00"},{"$f":"IF('Einsatz 2'!I35=\"\",\"\",'Einsatz 2'!I35)","v":""},{"$f":"IF('Einsatz 2'!J35=\"\",\"\",'Einsatz 2'!J35)","v":""},"00:00:00",{"$f":"IF('Einsatz 2'!L35=\"\",\"\",'Einsatz 2'!L35)","v":""},{"$f":"IF('Einsatz 2'!M35=\"\",\"\",'Einsatz 2'!M35)","v":""},{"v":0,"d":"0.00"},{"v":0,"d":"0.00"},{"$f":"IF('Einsatz 3'!I35=\"\",\"\",'Einsatz 3'!I35)","v":""},{"$f":"IF('Einsatz 3'!J35=\"\",\"\",'Einsatz 3'!J35)","v":""},"00:00:00",{"$f":"IF('Einsatz 3'!L35=\"\",\"\",'Einsatz 3'!L35)","v":""},{"$f":"IF('Einsatz 3'!M35=\"\",\"\",'Einsatz 3'!M35)","v":""},{"v":0,"d":"0.00"},{"v":0,"d":"0.00"},{"v":0,"d":"0.00"},{"v":0,"d":"0.00"}]
["Samstag","2023-01-28",{"$f":"'Einsatz 1'!C37","v":""},{"$f":"'Einsatz 1'!D37","v":0},{"$f":"'Einsatz 1'!E37","v":0},{"$f":"'Einsatz 1'!F37","v":0},{"$f":"'Einsatz 1'!G37","v":0},{"$f":"'Einsatz 1'!H37","v":"00:00:00"},{"$f":"IF('Einsatz 1'!I37=\"\",\"\",'Einsatz 1'!I37)","v":""},{"$f":"IF('Einsatz 1'!J37=\"\",\"\",'Einsatz 1'!J37)","v":""},"00:00:00",{"$f":"IF('Einsatz 1'!L37=\"\",\"\",'Einsatz 1'!L37)","v":""},{"$f":"IF('Einsatz 1'!M37=\"\",\"\",'Einsatz 1'!M37)","v":""},{"v":0,"d":"0.00"},{"v":0,"d":"0.00"},{"$f":"IF('Einsatz 2'!I36=\"\",\"\",'Einsatz 2'!I36)","v":""},{"$f":"IF('Einsatz 2'!J36=\"\",\"\",'Einsatz 2'!J36)","v":""},"00:00:00",{"$f":"IF('Einsatz 2'!L36=\"\",\"\",'Einsatz 2'!L36)","v":""},{"$f":"IF('Einsatz 2'!M36=\"\",\"\",'Einsatz 2'!M36)","v":""},{"v":0,"d":"0.00"},{"v":0,"d":"0.00"},{"$f":"IF('Einsatz 3'!I36=\"\",\"\",'Einsatz 3'!I36)","v":""},{"$f":"IF('Einsatz 3'!J36=\"\",\"\",'Einsatz 3'!J36)","v":""},"00:00:00",{"$f":"IF('Einsatz 3'!L36=\"\",\"\",'Einsatz 3'!L36)","v":""},{"$f":"IF('Einsatz 3'!M36=\"\",\"\",'Einsatz 3'!M36)","v":""},{"v":0,"d":"0.00"},{"v":0,"d":"0.00"},{"v":0,"d":"0.00"},{"v":0,"d":"0.00"}]
["Sonntag",{"$f":"IF(MONTH(B36+1)=W3,B36+1,\"\")","v":"2023-01-29"},{"$f":"'Einsatz 1'!C38","v":""},{"$f":"'Einsatz 1'!D38","v":0},{"$f":"'Einsatz 1'!E38","v":0},{"$f":"'Einsatz 1'!F38","v":0},{"$f":"'Einsatz 1'!G38","v":0},{"$f":"'Einsatz 1'!H38","v":"00:00:00"},{"$f":"IF('Einsatz 1'!I38=\"\",\"\",'Einsatz 1'!I38)","v":""},{"$f":"IF('Einsatz 1'!J38=\"\",\"\",'Einsatz 1'!J38)","v":""},"00:00:00",{"$f":"IF('Einsatz 1'!L38=\"\",\"\",'Einsatz 1'!L38)","v":""},{"$f":"IF('Einsatz 1'!M38=\"\",\"\",'Einsatz 1'!M38)","v":""},{"v":0,"d":"0.00"},{"v":0,"d":"0.00"},{"$f":"IF('Einsatz 2'!I37=\"\",\"\",'Einsatz 2'!I37)","v":""},{"$f":"IF('Einsatz 2'!J37=\"\",\"\",'Einsatz 2'!J37)","v":""},"00:00:00",{"$f":"IF('Einsatz 2'!L37=\"\",\"\",'Einsatz 2'!L37)","v":""},{"$f":"IF('Einsatz 2'!M37=\"\",\"\",'Einsatz 2'!M37)","v":""},{"v":0,"d":"0.00"},{"v":0,"d":"0.00"},{"$f":"IF('Einsatz 3'!I37=\"\",\"\",'Einsatz 3'!I37)","v":""},{"$f":"IF('Einsatz 3'!J37=\"\",\"\",'Einsatz 3'!J37)","v":""},"00:00:00",{"$f":"IF('Einsatz 3'!L37=\"\",\"\",'Einsatz 3'!L37)","v":""},{"$f":"IF('Einsatz 3'!M37=\"\",\"\",'Einsatz 3'!M37)","v":""},{"v":0,"d":"0.00"},{"v":0,"d":"0.00"},{"v":0,"d":"0.00"},{"v":0,"d":"0.00"}]
["Montag",{"$f":"IF(MONTH(B36+2)=W3,B36+2,\"\")","v":"2023-01-30"},{"$f":"'Einsatz 1'!C39","v":""},{"$f":"'Einsatz 1'!D39","v":0},{"$f":"'Einsatz 1'!E39","v":0},{"$f":"'Einsatz 1'!F39","v":0},{"$f":"'Einsatz 1'!G39","v":0},{"$f":"'Einsatz 1'!H39","v":"00:00:00"},{"$f":"IF('Einsatz 1'!I39=\"\",\"\",'Einsatz 1'!I39)","v":""},{"$f":"IF('Einsatz 1'!J39=\"\",\"\",'Einsatz 1'!J39)","v":""},"00:00:00",{"$f":"IF('Einsatz 1'!L39=\"\",\"\",'Einsatz 1'!L39)","v":""},{"$f":"IF('Einsatz 1'!M39=\"\",\"\",'Einsatz 1'!M39)","v":""},{"v":0,"d":"0.00"},{"v":0,"d":"0.00"},{"$f":"IF('Einsatz 2'!I38=\"\",\"\",'Einsatz 2'!I38)","v":""},{"$f":"IF('Einsatz 2'!J38=\"\",\"\",'Einsatz 2'!J38)","v":""},"00:00:00",{"$f":"IF('Einsatz 2'!L38=\"\",\"\",'Einsatz 2'!L38)","v":""},{"$f":"IF('Einsatz 2'!M38=\"\",\"\",'Einsatz 2'!M38)","v":""},{"v":0,"d":"0.00"},{"v":0,"d":"0.00"},{"$f":"IF('Einsatz 3'!I38=\"\",\"\",'Einsatz 3'!I38)","v":""},{"$f":"IF('Einsatz 3'!J38=\"\",\"\",'Einsatz 3'!J38)","v":""},"00:00:00",{"$f":"IF('Einsatz 3'!L38=\"\",\"\",'Einsatz 3'!L38)","v":""},{"$f":"IF('Einsatz 3'!M38=\"\",\"\",'Einsatz 3'!M38)","v":""},{"v":0,"d":"0.00"},{"v":0,"d":"0.00"},{"v":0,"d":"0.00"},{"v":0,"d":"0.00"}]
["Dienstag",{"$f":"IF(MONTH(B36+3)=W3,B36+3,\"\")","v":"2023-01-31"},{"$f":"'Einsatz 1'!C40","v":""},{"$f":"'Einsatz 1'!D40","v":0},{"$f":"'Einsatz 1'!E40","v":0},{"$f":"'Einsatz 1'!F40","v":0},{"$f":"'Einsatz 1'!G40","v":0},{"$f":"'Einsatz 1'!H40","v":"00:00:00"},{"$f":"IF('Einsatz 1'!I40=\"\",\"\",'Einsatz 1'!I40)","v":""},{"$f":"IF('Einsatz 1'!J40=\"\",\"\",'Einsatz 1'!J40)","v":""},"00:00:00",{"$f":"IF('Einsatz 1'!L40=\"\",\"\",'Einsatz 1'!L40)","v":""},{"$f":"IF('Einsatz 1'!M40=\"\",\"\",'Einsatz 1'!M40)","v":""},{"v":0,"d":"0.00"},{"v":0,"d":"0.00"},{"$f":"IF('Einsatz 2'!I39=\"\",\"\",'Einsatz 2'!I39)","v":""},{"$f":"IF('Einsatz 2'!J39=\"\",\"\",'Einsatz 2'!J39)","v":""},"00:00:00",{"$f":"IF('Einsatz 2'!L39=\"\",\"\",'Einsatz 2'!L39)","v":""},{"$f":"IF('Einsatz 2'!M39=\"\",\"\",'Einsatz 2'!M39)","v":""},{"v":0,"d":"0.00"},{"v":0,"d":"0.00"},{"$f":"IF('Einsatz 3'!I39=\"\",\"\",'Einsatz 3'!I39)","v":""},{"$f":"IF('Einsatz 3'!J39=\"\",\"\",'Einsatz 3'!J39)","v":""},"00:00:00",{"$f":"IF('Einsatz 3'!L39=\"\",\"\",'Einsatz 3'!L39)","v":""},{"$f":"IF('Einsatz 3'!M39=\"\",\"\",'Einsatz 3'!M39)","v":""},{"v":0,"d":"0.00"},{"v":0,"d":"0.00"},{"v":0,"d":"0.00"},{"v":0,"d":"0.00"}]
[{"$nulls":10},{"$f":"SUM(K9:K39)","v":"00:00:00"},{"$nulls":6},{"$f":"SUM(R9:R39)","v":"00:00:00"},{"$nulls":6},{"$f":"SUM(Y9:Y39)","v":"00:00:00"}]
[{"$nulls":3},{"$f":"'Einsatz 1'!D42","v":""},{"$f":"'Einsatz 1'!E42","v":""},{"$f":"'Einsatz 1'!F42","v":""},{"$f":"'Einsatz 1'!G42","v":""},{"$f":"'Einsatz 1'!H42","v":""}]
["* Es gelten nur die gesetzlichen Feiertage. Weihnachten und 1. Mai sind unter Lohnart 5071 gesondert berücksichtigt.",{"$nulls":7},"*** Auszuwählen ist \"ja\" nur an dem Tag, an dem die Rufbereitschaft begann."]
["** Auszuwählen ist an jedem Urlaubs- und/oder Krankheitstag jeweils \"ja\". ",{"$nulls":7},"**** Bei Einsätzen, für die eine Vor-Ort-Anwensenheit nicht erforderlich war, bitte auf \"ja\" klicken. In diesem Fall wird bei der Berechnung keine Wegezeit berücksichtigt. "]
[]
[null,"Ich versichere die Richtigkeit meiner Angaben (graue Felder): ",{"$nulls":8},"Die sachliche Richtigkeit der Angaben (graue Felder) wird bestätigt: "]
[]
[]
[]
[null,"Unterschrift Mitarbeiter*in",{"$nulls":8},"Unterschrift Vorgesetzte*r",{"$nulls":14},{"$f":"'Einsatz 1'!BV46","v":"Stand des Formulars: 01.02.2023"}]
[]
[]
[]
[]
[{"$nulls":3},"Einsatz 1",{"$nulls":6},"Einsatz 2",{"$nulls":7},"Einsatz 3"]
[{"$f":"A9","v":"Sonntag"},{"$f":"B9","v":"2023-01-01"},null,{"$f":"IF(M9=\"\",\"\",M9)","v":""},{"$nulls":6},{"$f":"IF(T9=\"\",\"\",T9)","v":""},{"$nulls":7},{"$f":"IF(AA9=\"\",\"\",AA9)","v":""}]
[{"$f":"A10","v":"Montag"},"2023-01-02",null,{"$f":"IF(M10=\"\",\"\",M10)","v":""},{"$nulls":6},{"$f":"IF(T10=\"\",\"\",T10)","v":""},{"$nulls":7},{"$f":"IF(AA10=\"\",\"\",AA10)","v":""}]
["Dienstag","2023-01-03",null,"",{"$nulls":6},"",{"$nulls":7},""]
["Mittwoch","2023-01-04",null,"",{"$nulls":6},"",{"$nulls":7},""]
["Donnerstag","2023-01-05",null,"",{"$nulls":6},"",{"$nulls":7},""]
["Freitag","2023-01-06",null,"",{"$nulls":6},"",{"$nulls":7},""]
["Samstag","2023-01-07",null,"",{"$nulls":6},"",{"$nulls":7},""]
["Sonntag","2023-01-08",null,"",{"$nulls":6},"",{"$nulls":7},""]
["Montag","2023-01-09",null,"",{"$nulls":6},"",{"$nulls":7},""]
["Dienstag","2023-01-10",null,"",{"$nulls":6},"",{"$nulls":7},""]
["Mittwoch","2023-01-11",null,"",{"$nulls":6},"",{"$nulls":7},""]
["Donnerstag","2023-01-12",null,"",{"$nulls":6},"",{"$nulls":7},""]
["Freitag","2023-01-13",null,"",{"$nulls":6},"",{"$nulls":7},""]
["Samstag","2023-01-14",null,"",{"$nulls":6},"",{"$nulls":7},""]
["Sonntag","2023-01-15",null,"",{"$nulls":6},"",{"$nulls":7},""]
["Montag","2023-01-16",null,"",{"$nulls":6},"",{"$nulls":7},""]
["Dienstag","2023-01-17",null,"",{"$nulls":6},"",{"$nulls":7},""]
["Mittwoch","2023-01-18",null,"",{"$nulls":6},"",{"$nulls":7},""]
["Donnerstag","2023-01-19",null,"",{"$nulls":6},"",{"$nulls":7},""]
["Freitag","2023-01-20",null,"",{"$nulls":6},"",{"$nulls":7},""]
["Samstag","2023-01-21",null,"",{"$nulls":6},"",{"$nulls":7},""]
["Sonntag","2023-01-22",null,"",{"$nulls":6},"",{"$nulls":7},""]
["Montag","2023-01-23",null,"",{"$nulls":6},"",{"$nulls":7},""]
["Dienstag","2023-01-24",null,"",{"$nulls":6},"",{"$nulls":7},""]
["Mittwoch","2023-01-25",null,"",{"$nulls":6},"",{"$nulls":7},""]
["Donnerstag","2023-01-26",null,"",{"$nulls":6},"",{"$nulls":7},""]
["Freitag","2023-01-27",null,"",{"$nulls":6},"",{"$nulls":7},""]
["Samstag","2023-01-28",null,"",{"$nulls":6},"",{"$nulls":7},""]
["Sonntag","2023-01-29",null,"",{"$nulls":6},"",{"$nulls":7},""]
["Montag","2023-01-30",null,"",{"$nulls":6},"",{"$nulls":7},""]
["Dienstag","2023-01-31",null,"",{"$nulls":6},"",{"$nulls":7},""]

{"sheet":"DRUCKEN - Übertrag Berechnung","index":4,"n_rows":43,"n_cols":18,"rows_kept":43,"merged":[[4,9,4,10]]}
["Nachweis über Überstunden, Überstundenvergütung und Zeitzuschläge ",{"$nulls":15},"Datum:",{"$f":"TODAY()","v":"2023-02-01"}]
[]
[null,null,"Übertrag und Berechnung",{"$nulls":4},"Rufbereitschaft und Zeitzuschläge",{"$nulls":5},"Monat:",{"$f":"'Einsatz 1'!BU3","v":1},"Jahr:",{"$f":"'Einsatz 1'!BW3","v":2023}]
[]
[null,null,"Name, Vorname:",{"$f":"'Einsatz 1'!D5","v":0},{"$nulls":4},"Orga-Einheit:",{"$f":"'Einsatz 1'!L5","v":"Dezernat 5.3"},{"$nulls":4},"Freizeitausgleich wird gewährt:",{"$f":"'Einsatz 1'!BV5","v":"ja"}]
[null,null,"Übliche Wegezeit (h:mm):",{"$f":"'Einsatz 1'!D6","v":"00:00:00"},null,"Industriestunden:",{"$f":"D6*24","v":{"v":0,"d":"0.00"}}]
["Tag","Datum","gesetzl. Feiertag in NRW*","Urlaub**","Krankheit (AU)**","Rufbereitschaft Mo-Fr 15:15 bis 07:00 des Folgetags***","Rufbereitschaft Sa, So, Feiertag (07:00 bis 07:00 des Folgetags)***","Rufbereitschaft       weniger als 12 Std.              (hh:mm)","Stunden mit Freizeitausgleich","Stunden ohne Freizeitausgleich","Arbeit am Samstag           13-20 Uhr","Arbeit am Samstag          20-21 Uhr","Arbeit am 24.12.& 31.12. \n 6-14 Uhr","Arbeit am 24.12. 14-24 Uhr; am 25./26.12.           & am 01.05. ","Arbeit am Sonntag","Arbeit am Feiertag mit Freizeitausgleich","Arbeit am Feiertag ohne Freizeitausgleich","Nachtarbeit                 (21-6 Uhr)"]
[{"$nulls":3},5167,5168,5200,5201,5204,5012,"5012 und 5014",5080,5083,5070,5071,5050,5061,"5060 und 5061",5040]
[{"$f":"TEXT(B9,\"TTTT\")","v":"Sonntag"},{"$f":"DATE(Q3,O3,1)","v":"2023-01-01"},{"$f":"'Einsatz 1'!C10","v":"Neujahr"},{"$f":"'Einsatz 1'!D10","v":0},{"$f":"'Einsatz 1'!E10","v":0},{"$f":"'Einsatz 1'!F10","v":0},{"$f":"'Einsatz 1'!G10","v":0},{"$f":"'Einsatz 1'!H10","v":"00:00:00"},{"$f":"IF($P$5=\"ja\",'DRUCKEN - Alle Einsätze'!AD9+'DRUCKEN - Alle Einsätze'!AE9,0)","v":{"v":0,"d":"0.00"}},{"$f":"IF($P$5=\"nein\",'DRUCKEN - Alle Einsätze'!AD9+'DRUCKEN - Alle Einsätze'!AE9,0)","v":{"v":0,"d":"0.00"}},{"$f":"'Einsatz 1'!BQ10+'Einsatz 2'!BQ9+'Einsatz 3'!BQ9","v":{"v":0,"d":"0.00"}},{"$f":"'Einsatz 1'!BR10+'Einsatz 2'!BR9+'Einsatz 3'!BR9","v":{"v":0,"d":"0.00"}},null,{"$f":"'Einsatz 1'!BT10+'Einsatz 2'!BT9+'Einsatz 3'!BT9","v":{"v":0,"d":"0.00"}},{"$f":"IF(N9<0,\"\",'Einsatz 1'!BU10+'Einsatz 2'!BU9+'Einsatz 3'!BU9)","v":{"v":0,"d":"0.00"}},{"$f":"IF(N9<0,\"\",'Einsatz 1'!BV10+'Einsatz 2'!BV9+'Einsatz 3'!BV9)","v":{"v":0,"d":"0.00"}},{"$f":"'Einsatz 1'!BW10+'Einsatz 2'!BW9+'Einsatz 3'!BW9","v":{"v":0,"d":"0.00"}},{"$f":"'Einsatz 1'!BX10+'Einsatz 2'!BX9+'Einsatz 3'!BX9","v":{"v":0,"d":"0.00"}}]
[{"$f":"TEXT(B10,\"TTTT\")","v":"Montag"},{"$f":"B9+1","v":"2023-01-02"},{"$f":"'Einsatz 1'!C11","v":""},{"$f":"'Einsatz 1'!D11","v":0},{"$f":"'Einsatz 1'!E11","v":0},{"$f":"'Einsatz 1'!F11","v":0},{"$f":"'Einsatz 1'!G11","v":0},{"$f":"'Einsatz 1'!H11","v":"00:00:00"},{"$f":"IF($P$5=\"ja\",'DRUCKEN - Alle Einsätze'!AD10+'DRUCKEN - Alle Einsätze'!AE10,0)","v":{"v":0,"d":"0.00"}},{"$f":"IF($P$5=\"nein\",'DRUCKEN - Alle Einsätze'!AD10+'DRUCKEN - Alle Einsätze'!AE10,0)","v":{"v":0,"d":"0.00"}},{"$f":"'Einsatz 1'!BQ11+'Einsatz 2'!BQ10+'Einsatz 3'!BQ10","v":{"v":0,"d":"0.00"}},{"$f":"'Einsatz 1'!BR11+'Einsatz 2'!BR10+'Einsatz 3'!BR10","v":{"v":0,"d":"0.00"}},null,null,{"$f":"'Einsatz 1'!BU11+'Einsatz 2'!BU10+'Einsatz 3'!BU10","v":{"v":0,"d":"0.00"}},{"$f":"'Einsatz 1'!BV11+'Einsatz 2'!BV10+'Einsatz 3'!BV10","v":{"v":0,"d":"0.00"}},{"$f":"'Einsatz 1'!BW11+'Einsatz 2'!BW10+'Einsatz 3'!BW10","v":{"v":0,"d":"0.00"}},{"$f":"'Einsatz 1'!BX11+'Einsatz 2'!BX10+'Einsatz 3'!BX10","v":{"v":0,"d":"0.00"}}]
["Dienstag",{"$f":"B10+1","v":"2023-01-03"},{"$f":"'Einsatz 1'!C12","v":""},{"$f":"'Einsatz 1'!D12","v":0},{"$f":"'Einsatz 1'!E12","v":0},{"$f":"'Einsatz 1'!F12","v":0},{"$f":"'Einsatz 1'!G12","v":0},{"$f":"'Einsatz 1'!H12","v":"00:00:00"},{"$f":"IF($P$5=\"ja\",'DRUCKEN - Alle Einsätze'!AD11+'DRUCKEN - Alle Einsätze'!AE11,0)","v":{"v":0,"d":"0.00"}},{"$f":"IF($P$5=\"nein\",'DRUCKEN - Alle Einsätze'!AD11+'DRUCKEN - Alle Einsätze'!AE11,0)","v":{"v":0,"d":"0.00"}},{"$f":"'Einsatz 1'!BQ12+'Einsatz 2'!BQ11+'Einsatz 3'!BQ11","v":{"v":0,"d":"0.00"}},{"$f":"'Einsatz 1'!BR12+'Einsatz 2'!BR11+'Einsatz 3'!BR11","v":{"v":0,"d":"0.00"}},null,null,{"$f":"'Einsatz 1'!BU12+'Einsatz 2'!BU11+'Einsatz 3'!BU11","v":{"v":0,"d":"0.00"}},{"$f":"'Einsatz 1'!BV12+'Einsatz 2'!BV11+'Einsatz 3'!BV11","v":{"v":0,"d":"0.00"}},{"$f":"'Einsatz 1'!BW12+'Einsatz 2'!BW11+'Einsatz 3'!BW11","v":{"v":0,"d":"0.00"}},{"$f":"'Einsatz 1'!BX12+'Einsatz 2'!BX11+'Einsatz 3'!BX11","v":{"v":0,"d":"0.00"}}]
["Mittwoch","2023-01-04",{"$f":"'Einsatz 1'!C13","v":""},{"$f":"'Einsatz 1'!D13","v":0},{"$f":"'Einsatz 1'!E13","v":0},{"$f":"'Einsatz 1'!F13","v":0},{"$f":"'Einsatz 1'!G13","v":0},{"$f":"'Einsatz 1'!H13","v":"00:00:00"},{"$f":"IF($P$5=\"ja\",'DRUCKEN - Alle Einsätze'!AD12+'DRUCKEN - Alle Einsätze'!AE12,0)","v":{"v":0,"d":"0.00"}},{"$f":"IF($P$5=\"nein\",'DRUCKEN - Alle Einsätze'!AD12+'DRUCKEN - Alle Einsätze'!AE12,0)","v":{"v":0,"d":"0.00"}},{"$f":"'Einsatz 1'!BQ13+'Einsatz 2'!BQ12+'Einsatz 3'!BQ12","v":{"v":0,"d":"0.00"}},{"$f":"'Einsatz 1'!BR13+'Einsatz 2'!BR12+'Einsatz 3'!BR12","v":{"v":0,"d":"0.00"}},null,null,{"$f":"'Einsatz 1'!BU13+'Einsatz 2'!BU12+'Einsatz 3'!BU12","v":{"v":0,"d":"0.00"}},{"$f":"'Einsatz 1'!BV13+'Einsatz 2'!BV12+'Einsatz 3'!BV12","v":{"v":0,"d":"0.00"}},{"$f":"'Einsatz 1'!BW13+'Einsatz 2'!BW12+'Einsatz 3'!BW12","v":{"v":0,"d":"0.00"}},{"$f":"'Einsatz 1'!BX13+'Einsatz 2'!BX12+'Einsatz 3'!BX12","v":{"v":0,"d":"0.00"}}]
["Donnerstag","2023-01-05",{"$f":"'Einsatz 1'!C14","v":""},{"$f":"'Einsatz 1'!D14","v":0},{"$f":"'Einsatz 1'!E14","v":0},{"$f":"'Einsatz 1'!F14","v":0},{"$f":"'Einsatz 1'!G14","v":0},{"$f":"'Einsatz 1'!H14","v":"00:00:00"},{"$f":"IF($P$5=\"ja\",'DRUCKEN - Alle Einsätze'!AD13+'DRUCKEN - Alle Einsätze'!AE13,0)","v":{"v":0,"d":"0.00"}},{"$f":"IF($P$5=\"nein\",'DRUCKEN - Alle Einsätze'!AD13+'DRUCKEN - Alle Einsätze'!AE13,0)","v":{"v":0,"d":"0.00"}},{"$f":"'Einsatz 1'!BQ14+'Einsatz 2'!BQ13+'Einsatz 3'!BQ13","v":{"v":0,"d":"0.00"}},{"$f":"'Einsatz 1'!BR14+'Einsatz 2'!BR13+'Einsatz 3'!BR13","v":{"v":0,"d":"0.00"}},null,null,{"$f":"'Einsatz 1'!BU14+'Einsatz 2'!BU13+'Einsatz 3'!BU13","v":{"v":0,"d":"0.00"}},{"$f":"'Einsatz 1'!BV14+'Einsatz 2'!BV13+'Einsatz 3'!BV13","v":{"v":0,"d":"0.00"}},{"$f":"'Einsatz 1'!BW14+'Einsatz 2'!BW13+'Einsatz 3'!BW13","v":{"v":0,"d":"0.00"}},{"$f":"'Einsatz 1'!BX14+'Einsatz 2'!BX13+'Einsatz 3'!BX13","v":{"v":0,"d":"0.00"}}]
["Freitag","2023-01-06",{"$f":"'Einsatz 1'!C15","v":""},{"$f":"'Einsatz 1'!D15","v":0},{"$f":"'Einsatz 1'!E15","v":0},{"$f":"'Einsatz 1'!F15","v":0},{"$f":"'Einsatz 1'!G15","v":0},{"$f":"'Einsatz 1'!H15","v":"00:00:00"},{"$f":"IF($P$5=\"ja\",'DRUCKEN - Alle Einsätze'!AD14+'DRUCKEN - Alle Einsätze'!AE14,0)","v":{"v":0,"d":"0.00"}},{"$f":"IF($P$5=\"nein\",'DRUCKEN - Alle Einsätze'!AD14+'DRUCKEN - Alle Einsätze'!AE14,0)","v":{"v":0,"d":"0.00"}},{"$f":"'Einsatz 1'!BQ15+'Einsatz 2'!BQ14+'Einsatz 3'!BQ14","v":{"v":0,"d":"0.00"}},{"$f":"'Einsatz 1'!BR15+'Einsatz 2'!BR14+'Einsatz 3'!BR14","v":{"v":0,"d":"0.00"}},null,null,{"$f":"'Einsatz 1'!BU15+'Einsatz 2'!BU14+'Einsatz 3'!BU14","v":{"v":0,"d":"0.00"}},{"$f":"'Einsatz 1'!BV15+'Einsatz 2'!BV14+'Einsatz 3'!BV14","v":{"v":0,"d":"0.00"}},{"$f":"'Einsatz 1'!BW15+'Einsatz 2'!BW14+'Einsatz 3'!BW14","v":{"v":0,"d":"0.00"}},{"$f":"'Einsatz 1'!BX15+'Einsatz 2'!BX14+'Einsatz 3'!BX14","v":{"v":0,"d":"0.00"}}]
["Samstag","2023-01-07",{"$f":"'Einsatz 1'!C16","v":""},{"$f":"'Einsatz 1'!D16","v":0},{"$f":"'Einsatz 1'!E16","v":0},{"$f":"'Einsatz 1'!F16","v":0},{"$f":"'Einsatz 1'!G16","v":0},{"$f":"'Einsatz 1'!H16","v":"00:00:00"},{"$f":"IF($P$5=\"ja\",'DRUCKEN - Alle Einsätze'!AD15+'DRUCKEN - Alle Einsätze'!AE15,0)","v":{"v":0,"d":"0.00"}},{"$f":"IF($P$5=\"nein\",'DRUCKEN - Alle Einsätze'!AD15+'DRUCKEN - Alle Einsätze'!AE15,0)","v":{"v":0,"d":"0.00"}},{"$f":"'Einsatz 1'!BQ16+'Einsatz 2'!BQ15+'Einsatz 3'!BQ15","v":{"v":0,"d":"0.00"}},{"$f":"'Einsatz 1'!BR16+'Einsatz 2'!BR15+'Einsatz 3'!BR15","v":{"v":0,"d":"0.00"}},null,null,{"$f":"'Einsatz 1'!BU16+'Einsatz 2'!BU15+'Einsatz 3'!BU15","v":{"v":0,"d":"0.00"}},{"$f":"'Einsatz 1'!BV16+'Einsatz 2'!BV15+'Einsatz 3'!BV15","v":{"v":0,"d":"0.00"}},{"$f":"'Einsatz 1'!BW16+'Einsatz 2'!BW15+'Einsatz 3'!BW15","v":{"v":0,"d":"0.00"}},{"$f":"'Einsatz 1'!BX16+'Einsatz 2'!BX15+'Einsatz 3'!BX15","v":{"v":0,"d":"0.00"}}]
["Sonntag","2023-01-08",{"$f":"'Einsatz 1'!C17","v":""},{"$f":"'Einsatz 1'!D17","v":0},{"$f":"'Einsatz 1'!E17","v":0},{"$f":"'Einsatz 1'!F17","v":0},{"$f":"'Einsatz 1'!G17","v":0},{"$f":"'Einsatz 1'!H17","v":"00:00:00"},{"$f":"IF($P$5=\"ja\",'DRUCKEN - Alle Einsätze'!AD16+'DRUCKEN - Alle Einsätze'!AE16,0)","v":{"v":0,"d":"0.00"}},{"$f":"IF($P$5=\"nein\",'DRUCKEN - Alle Einsätze'!AD16+'DRUCKEN - Alle Einsätze'!AE16,0)","v":{"v":0,"d":"0.00"}},{"$f":"'Einsatz 1'!BQ17+'Einsatz 2'!BQ16+'Einsatz 3'!BQ16","v":{"v":0,"d":"0.00"}},{"$f":"'Einsatz 1'!BR17+'Einsatz 2'!BR16+'Einsatz 3'!BR16","v":{"v":0,"d":"0.00"}},null,null,{"$f":"'Einsatz 1'!BU17+'Einsatz 2'!BU16+'Einsatz 3'!BU16","v":{"v":0,"d":"0.00"}},{"$f":"'Einsatz 1'!BV17+'Einsatz 2'!BV16+'Einsatz 3'!BV16","v":{"v":0,"d":"0.00"}},{"$f":"'Einsatz 1'!BW17+'Einsatz 2'!BW16+'Einsatz 3'!BW16","v":{"v":0,"d":"0.00"}},{"$f":"'Einsatz 1'!BX17+'Einsatz 2'!BX16+'Einsatz 3'!BX16","v":{"v":0,"d":"0.00"}}]
["Montag","2023-01-09",{"$f":"'Einsatz 1'!C18","v":""},{"$f":"'Einsatz 1'!D18","v":0},{"$f":"'Einsatz 1'!E18","v":0},{"$f":"'Einsatz 1'!F18","v":0},{"$f":"'Einsatz 1'!G18","v":0},{"$f":"'Einsatz 1'!H18","v":"00:00:00"},{"$f":"IF($P$5=\"ja\",'DRUCKEN - Alle Einsätze'!AD17+'DRUCKEN - Alle Einsätze'!AE17,0)","v":{"v":0,"d":"0.00"}},{"$f":"IF($P$5=\"nein\",'DRUCKEN - Alle Einsätze'!AD17+'DRUCKEN - Alle Einsätze'!AE17,0)","v":{"v":0,"d":"0.00"}},{"$f":"'Einsatz 1'!BQ18+'Einsatz 2'!BQ17+'Einsatz 3'!BQ17","v":{"v":0,"d":"0.00"}},{"$f":"'Einsatz 1'!BR18+'Einsatz 2'!BR17+'Einsatz 3'!BR17","v":{"v":0,"d":"0.00"}},null,null,{"$f":"'Einsatz 1'!BU18+'Einsatz 2'!BU17+'Einsatz 3'!BU17","v":{"v":0,"d":"0.00"}},{"$f":"'Einsatz 1'!BV18+'Einsatz 2'!BV17+'Einsatz 3'!BV17","v":{"v":0,"d":"0.00"}},{"$f":"'Einsatz 1'!BW18+'Einsatz 2'!BW17+'Einsatz 3'!BW17","v":{"v":0,"d":"0.00"}},{"$f":"'Einsatz 1'!BX18+'Einsatz 2'!BX17+'Einsatz 3'!BX17","v":{"v":0,"d":"0.00"}}]
["Dienstag","2023-01-10",{"$f":"'Einsatz 1'!C19","v":""},{"$f":"'Einsatz 1'!D19","v":0},{"$f":"'Einsatz 1'!E19","v":0},{"$f":"'Einsatz 1'!F19","v":0},{"$f":"'Einsatz 1'!G19","v":0},{"$f":"'Einsatz 1'!H19","v":"00:00:00"},{"$f":"IF($P$5=\"ja\",'DRUCKEN - Alle Einsätze'!AD18+'DRUCKEN - Alle Einsätze'!AE18,0)","v":{"v":0,"d":"0.00"}},{"$f":"IF($P$5=\"nein\",'DRUCKEN - Alle Einsätze'!AD18+'DRUCKEN - Alle Einsätze'!AE18,0)","v":{"v":0,"d":"0.00"}},{"$f":"'Einsatz 1'!BQ19+'Einsatz 2'!BQ18+'Einsatz 3'!BQ18","v":{"v":0,"d":"0.00"}},{"$f":"'Einsatz 1'!BR19+'Einsatz 2'!BR18+'Einsatz 3'!BR18","v":{"v":0,"d":"0.00"}},null,null,{"$f":"'Einsatz 1'!BU19+'Einsatz 2'!BU18+'Einsatz 3'!BU18","v":{"v":0,"d":"0.00"}},{"$f":"'Einsatz 1'!BV19+'Einsatz 2'!BV18+'Einsatz 3'!BV18","v":{"v":0,"d":"0.00"}},{"$f":"'Einsatz 1'!BW19+'Einsatz 2'!BW18+'Einsatz 3'!BW18","v":{"v":0,"d":"0.00"}},{"$f":"'Einsatz 1'!BX19+'Einsatz 2'!BX18+'Einsatz 3'!BX18","v":{"v":0,"d":"0.00"}}]
["Mittwoch","2023-01-11",{"$f":"'Einsatz 1'!C20","v":""},{"$f":"'Einsatz 1'!D20","v":0},{"$f":"'Einsatz 1'!E20","v":0},{"$f":"'Einsatz 1'!F20","v":0},{"$f":"'Einsatz 1'!G20","v":0},{"$f":"'Einsatz 1'!H20","v":"00:00:00"},{"$f":"IF($P$5=\"ja\",'DRUCKEN - Alle Einsätze'!AD19+'DRUCKEN - Alle Einsätze'!AE19,0)","v":{"v":0,"d":"0.00"}},{"$f":"IF($P$5=\"nein\",'DRUCKEN - Alle Einsätze'!AD19+'DRUCKEN - Alle Einsätze'!AE19,0)","v":{"v":0,"d":"0.00"}},{"$f":"'Einsatz 1'!BQ20+'Einsatz 2'!BQ19+'Einsatz 3'!BQ19","v":{"v":0,"d":"0.00"}},{"$f":"'Einsatz 1'!BR20+'Einsatz 2'!BR19+'Einsatz 3'!BR19","v":{"v":0,"d":"0.00"}},null,null,{"$f":"'Einsatz 1'!BU20+'Einsatz 2'!BU19+'Einsatz 3'!BU19","v":{"v":0,"d":"0.00"}},{"$f":"'Einsatz 1'!BV20+'Einsatz 2'!BV19+'Einsatz 3'!BV19","v":{"v":0,"d":"0.00"}},{"$f":"'Einsatz 1'!BW20+'Einsatz 2'!BW19+'Einsatz 3'!BW19","v":{"v":0,"d":"0.00"}},{"$f":"'Einsatz 1'!BX20+'Einsatz 2'!BX19+'Einsatz 3'!BX19","v":{"v":0,"d":"0.00"}}]
["Donnerstag","2023-01-12",{"$f":"'Einsatz 1'!C21","v":""},{"$f":"'Einsatz 1'!D21","v":0},{"$f":"'Einsatz 1'!E21","v":0},{"$f":"'Einsatz 1'!F21","v":0},{"$f":"'Einsatz 1'!G21","v":0},{"$f":"'Einsatz 1'!H21","v":"00:00:00"},{"$f":"IF($P$5=\"ja\",'DRUCKEN - Alle Einsätze'!AD20+'DRUCKEN - Alle Einsätze'!AE20,0)","v":{"v":0,"d":"0.00"}},{"$f":"IF($P$5=\"nein\",'DRUCKEN - Alle Einsätze'!AD20+'DRUCKEN - Alle Einsätze'!AE20,0)","v":{"v":0,"d":"0.00"}},{"$f":"'Einsatz 1'!BQ21+'Einsatz 2'!BQ20+'Einsatz 3'!BQ20","v":{"v":0,"d":"0.00"}},{"$f":"'Einsatz 1'!BR21+'Einsatz 2'!BR20+'Einsatz 3'!BR20","v":{"v":0,"d":"0.00"}},null,null,{"$f":"'Einsatz 1'!BU21+'Einsatz 2'!BU20+'Einsatz 3'!BU20","v":{"v":0,"d":"0.00"}},{"$f":"'Einsatz 1'!BV21+'Einsatz 2'!BV20+'Einsatz 3'!BV20","v":{"v":0,"d":"0.00"}},{"$f":"'Einsatz 1'!BW21+'Einsatz 2'!BW20+'Einsatz 3'!BW20","v":{"v":0,"d":"0.00"}},{"$f":"'Einsatz 1'!BX21+'Einsatz 2'!BX20+'Einsatz 3'!BX20","v":{"v":0,"d":"0.00"}}]
["Freitag","2023-01-13",{"$f":"'Einsatz 1'!C22","v":""},{"$f":"'Einsatz 1'!D22","v":0},{"$f":"'Einsatz 1'!E22","v":0},{"$f":"'Einsatz 1'!F22","v":0},{"$f":"'Einsatz 1'!G22","v":0},{"$f":"'Einsatz 1'!H22","v":"00:00:00"},{"$f":"IF($P$5=\"ja\",'DRUCKEN - Alle Einsätze'!AD21+'DRUCKEN - Alle Einsätze'!AE21,0)","v":{"v":0,"d":"0.00"}},{"$f":"IF($P$5=\"nein\",'DRUCKEN - Alle Einsätze'!AD21+'DRUCKEN - Alle Einsätze'!AE21,0)","v":{"v":0,"d":"0.00"}},{"$f":"'Einsatz 1'!BQ22+'Einsatz 2'!BQ21+'Einsatz 3'!BQ21","v":{"v":0,"d":"0.00"}},{"$f":"'Einsatz 1'!BR22+'Einsatz 2'!BR21+'Einsatz 3'!BR21","v":{"v":0,"d":"0.00"}},null,null,{"$f":"'Einsatz 1'!BU22+'Einsatz 2'!BU21+'Einsatz 3'!BU21","v":{"v":0,"d":"0.00"}},{"$f":"'Einsatz 1'!BV22+'Einsatz 2'!BV21+'Einsatz 3'!BV21","v":{"v":0,"d":"0.00"}},{"$f":"'Einsatz 1'!BW22+'Einsatz 2'!BW21+'Einsatz 3'!BW21","v":{"v":0,"d":"0.00"}},{"$f":"'Einsatz 1'!BX22+'Einsatz 2'!BX21+'Einsatz 3'!BX21","v":{"v":0,"d":"0.00"}}]
["Samstag","2023-01-14",{"$f":"'Einsatz 1'!C23","v":""},{"$f":"'Einsatz 1'!D23","v":0},{"$f":"'Einsatz 1'!E23","v":0},{"$f":"'Einsatz 1'!F23","v":0},{"$f":"'Einsatz 1'!G23","v":0},{"$f":"'Einsatz 1'!H23","v":"00:00:00"},{"$f":"IF($P$5=\"ja\",'DRUCKEN - Alle Einsätze'!AD22+'DRUCKEN - Alle Einsätze'!AE22,0)","v":{"v":0,"d":"0.00"}},{"$f":"IF($P$5=\"nein\",'DRUCKEN - Alle Einsätze'!AD22+'DRUCKEN - Alle Einsätze'!AE22,0)","v":{"v":0,"d":"0.00"}},{"$f":"'Einsatz 1'!BQ23+'Einsatz 2'!BQ22+'Einsatz 3'!BQ22","v":{"v":0,"d":"0.00"}},{"$f":"'Einsatz 1'!BR23+'Einsatz 2'!BR22+'Einsatz 3'!BR22","v":{"v":0,"d":"0.00"}},null,null,{"$f":"'Einsatz 1'!BU23+'Einsatz 2'!BU22+'Einsatz 3'!BU22","v":{"v":0,"d":"0.00"}},{"$f":"'Einsatz 1'!BV23+'Einsatz 2'!BV22+'Einsatz 3'!BV22","v":{"v":0,"d":"0.00"}},{"$f":"'Einsatz 1'!BW23+'Einsatz 2'!BW22+'Einsatz 3'!BW22","v":{"v":0,"d":"0.00"}},{"$f":"'Einsatz 1'!BX23+'Einsatz 2'!BX22+'Einsatz 3'!BX22","v":{"v":0,"d":"0.00"}}]
["Sonntag","2023-01-15",{"$f":"'Einsatz 1'!C24","v":""},{"$f":"'Einsatz 1'!D24","v":0},{"$f":"'Einsatz 1'!E24","v":0},{"$f":"'Einsatz 1'!F24","v":0},{"$f":"'Einsatz 1'!G24","v":0},{"$f":"'Einsatz 1'!H24","v":"00:00:00"},{"$f":"IF($P$5=\"ja\",'DRUCKEN - Alle Einsätze'!AD23+'DRUCKEN - Alle Einsätze'!AE23,0)","v":{"v":0,"d":"0.00"}},{"$f":"IF($P$5=\"nein\",'DRUCKEN - Alle Einsätze'!AD23+'DRUCKEN - Alle Einsätze'!AE23,0)","v":{"v":0,"d":"0.00"}},{"$f":"'Einsatz 1'!BQ24+'Einsatz 2'!BQ23+'Einsatz 3'!BQ23","v":{"v":0,"d":"0.00"}},{"$f":"'Einsatz 1'!BR24+'Einsatz 2'!BR23+'Einsatz 3'!BR23","v":{"v":0,"d":"0.00"}},null,null,{"$f":"'Einsatz 1'!BU24+'Einsatz 2'!BU23+'Einsatz 3'!BU23","v":{"v":0,"d":"0.00"}},{"$f":"'Einsatz 1'!BV24+'Einsatz 2'!BV23+'Einsatz 3'!BV23","v":{"v":0,"d":"0.00"}},{"$f":"'Einsatz 1'!BW24+'Einsatz 2'!BW23+'Einsatz 3'!BW23","v":{"v":0,"d":"0.00"}},{"$f":"'Einsatz 1'!BX24+'Einsatz 2'!BX23+'Einsatz 3'!BX23","v":{"v":0,"d":"0.00"}}]
["Montag","2023-01-16",{"$f":"'Einsatz 1'!C25","v":""},{"$f":"'Einsatz 1'!D25","v":0},{"$f":"'Einsatz 1'!E25","v":0},{"$f":"'Einsatz 1'!F25","v":0},{"$f":"'Einsatz 1'!G25","v":0},{"$f":"'Einsatz 1'!H25","v":"00:00:00"},{"$f":"IF($P$5=\"ja\",'DRUCKEN - Alle Einsätze'!AD24+'DRUCKEN - Alle Einsätze'!AE24,0)","v":{"v":0,"d":"0.00"}},{"$f":"IF($P$5=\"nein\",'DRUCKEN - Alle Einsätze'!AD24+'DRUCKEN - Alle Einsätze'!AE24,0)","v":{"v":0,"d":"0.00"}},{"$f":"'Einsatz 1'!BQ25+'Einsatz 2'!BQ24+'Einsatz 3'!BQ24","v":{"v":0,"d":"0.00"}},{"$f":"'Einsatz 1'!BR25+'Einsatz 2'!BR24+'Einsatz 3'!BR24","v":{"v":0,"d":"0.00"}},null,null,{"$f":"'Einsatz 1'!BU25+'Einsatz 2'!BU24+'Einsatz 3'!BU24","v":{"v":0,"d":"0.00"}},{"$f":"'Einsatz 1'!BV25+'Einsatz 2'!BV24+'Einsatz 3'!BV24","v":{"v":0,"d":"0.00"}},{"$f":"'Einsatz 1'!BW25+'Einsatz 2'!BW24+'Einsatz 3'!BW24","v":{"v":0,"d":"0.00"}},{"$f":"'Einsatz 1'!BX25+'Einsatz 2'!BX24+'Einsatz 3'!BX24","v":{"v":0,"d":"0.00"}}]
["Dienstag","2023-01-17",{"$f":"'Einsatz 1'!C26","v":""},{"$f":"'Einsatz 1'!D26","v":0},{"$f":"'Einsatz 1'!E26","v":0},{"$f":"'Einsatz 1'!F26","v":0},{"$f":"'Einsatz 1'!G26","v":0},{"$f":"'Einsatz 1'!H26","v":"00:00:00"},{"$f":"IF($P$5=\"ja\",'DRUCKEN - Alle Einsätze'!AD25+'DRUCKEN - Alle Einsätze'!AE25,0)","v":{"v":0,"d":"0.00"}},{"$f":"IF($P$5=\"nein\",'DRUCKEN - Alle Einsätze'!AD25+'DRUCKEN - Alle Einsätze'!AE25,0)","v":{"v":0,"d":"0.00"}},{"$f":"'Einsatz 1'!BQ26+'Einsatz 2'!BQ25+'Einsatz 3'!BQ25","v":{"v":0,"d":"0.00"}},{"$f":"'Einsatz 1'!BR26+'Einsatz 2'!BR25+'Einsatz 3'!BR25","v":{"v":0,"d":"0.00"}},null,null,{"$f":"'Einsatz 1'!BU26+'Einsatz 2'!BU25+'Einsatz 3'!BU25","v":{"v":0,"d":"0.00"}},{"$f":"'Einsatz 1'!BV26+'Einsatz 2'!BV25+'Einsatz 3'!BV25","v":{"v":0,"d":"0.00"}},{"$f":"'Einsatz 1'!BW26+'Einsatz 2'!BW25+'Einsatz 3'!BW25","v":{"v":0,"d":"0.00"}},{"$f":"'Einsatz 1'!BX26+'Einsatz 2'!BX25+'Einsatz 3'!BX25","v":{"v":0,"d":"0.00"}}]
["Mittwoch","2023-01-18",{"$f":"'Einsatz 1'!C27","v":""},{"$f":"'Einsatz 1'!D27","v":0},{"$f":"'Einsatz 1'!E27","v":0},{"$f":"'Einsatz 1'!F27","v":0},{"$f":"'Einsatz 1'!G27","v":0},{"$f":"'Einsatz 1'!H27","v":"00:00:00"},{"$f":"IF($P$5=\"ja\",'DRUCKEN - Alle Einsätze'!AD26+'DRUCKEN - Alle Einsätze'!AE26,0)","v":{"v":0,"d":"0.00"}},{"$f":"IF($P$5=\"nein\",'DRUCKEN - Alle Einsätze'!AD26+'DRUCKEN - Alle Einsätze'!AE26,0)","v":{"v":0,"d":"0.00"}},{"$f":"'Einsatz 1'!BQ27+'Einsatz 2'!BQ26+'Einsatz 3'!BQ26","v":{"v":0,"d":"0.00"}},{"$f":"'Einsatz 1'!BR27+'Einsatz 2'!BR26+'Einsatz 3'!BR26","v":{"v":0,"d":"0.00"}},null,null,{"$f":"'Einsatz 1'!BU27+'Einsatz 2'!BU26+'Einsatz 3'!BU26","v":{"v":0,"d":"0.00"}},{"$f":"'Einsatz 1'!BV27+'Einsatz 2'!BV26+'Einsatz 3'!BV26","v":{"v":0,"d":"0.00"}},{"$f":"'Einsatz 1'!BW27+'Einsatz 2'!BW26+'Einsatz 3'!BW26","v":{"v":0,"d":"0.00"}},{"$f":"'Einsatz 1'!BX27+'Einsatz 2'!BX26+'Einsatz 3'!BX26","v":{"v":0,"d":"0.00"}}]
["Donnerstag","2023-01-19",{"$f":"'Einsatz 1'!C28","v":""},{"$f":"'Einsatz 1'!D28","v":0},{"$f":"'Einsatz 1'!E28","v":0},{"$f":"'Einsatz 1'!F28","v":0},{"$f":"'Einsatz 1'!G28","v":0},{"$f":"'Einsatz 1'!H28","v":"00:00:00"},{"$f":"IF($P$5=\"ja\",'DRUCKEN - Alle Einsätze'!AD27+'DRUCKEN - Alle Einsätze'!AE27,0)","v":{"v":0,"d":"0.00"}},{"$f":"IF($P$5=\"nein\",'DRUCKEN - Alle Einsätze'!AD27+'DRUCKEN - Alle Einsätze'!AE27,0)","v":{"v":0,"d":"0.00"}},{"$f":"'Einsatz 1'!BQ28+'Einsatz 2'!BQ27+'Einsatz 3'!BQ27","v":{"v":0,"d":"0.00"}},{"$f":"'Einsatz 1'!BR28+'Einsatz 2'!BR27+'Einsatz 3'!BR27","v":{"v":0,"d":"0.00"}},null,null,{"$f":"'Einsatz 1'!BU28+'Einsatz 2'!BU27+'Einsatz 3'!BU27","v":{"v":0,"d":"0.00"}},{"$f":"'Einsatz 1'!BV28+'Einsatz 2'!BV27+'Einsatz 3'!BV27","v":{"v":0,"d":"0.00"}},{"$f":"'Einsatz 1'!BW28+'Einsatz 2'!BW27+'Einsatz 3'!BW27","v":{"v":0,"d":"0.00"}},{"$f":"'Einsatz 1'!BX28+'Einsatz 2'!BX27+'Einsatz 3'!BX27","v":{"v":0,"d":"0.00"}}]
["Freitag","2023-01-20",{"$f":"'Einsatz 1'!C29","v":""},{"$f":"'Einsatz 1'!D29","v":0},{"$f":"'Einsatz 1'!E29","v":0},{"$f":"'Einsatz 1'!F29","v":0},{"$f":"'Einsatz 1'!G29","v":0},{"$f":"'Einsatz 1'!H29","v":"00:00:00"},{"$f":"IF($P$5=\"ja\",'DRUCKEN - Alle Einsätze'!AD28+'DRUCKEN - Alle Einsätze'!AE28,0)","v":{"v":0,"d":"0.00"}},{"$f":"IF($P$5=\"nein\",'DRUCKEN - Alle Einsätze'!AD28+'DRUCKEN - Alle Einsätze'!AE28,0)","v":{"v":0,"d":"0.00"}},{"$f":"'Einsatz 1'!BQ29+'Einsatz 2'!BQ28+'Einsatz 3'!BQ28","v":{"v":0,"d":"0.00"}},{"$f":"'Einsatz 1'!BR29+'Einsatz 2'!BR28+'Einsatz 3'!BR28","v":{"v":0,"d":"0.00"}},null,null,{"$f":"'Einsatz 1'!BU29+'Einsatz 2'!BU28+'Einsatz 3'!BU28","v":{"v":0,"d":"0.00"}},{"$f":"'Einsatz 1'!BV29+'Einsatz 2'!BV28+'Einsatz 3'!BV28","v":{"v":0,"d":"0.00"}},{"$f":"'Einsatz 1'!BW29+'Einsatz 2'!BW28+'Einsatz 3'!BW28","v":{"v":0,"d":"0.00"}},{"$f":"'Einsatz 1'!BX29+'Einsatz 2'!BX28+'Einsatz 3'!BX28","v":{"v":0,"d":"0.00"}}]
["Samstag","2023-01-21",{"$f":"'Einsatz 1'!C30","v":""},{"$f":"'Einsatz 1'!D30","v":0},{"$f":"'Einsatz 1'!E30","v":0},{"$f":"'Einsatz 1'!F30","v":0},{"$f":"'Einsatz 1'!G30","v":0},{"$f":"'Einsatz 1'!H30","v":"00:00:00"},{"$f":"IF($P$5=\"ja\",'DRUCKEN - Alle Einsätze'!AD29+'DRUCKEN - Alle Einsätze'!AE29,0)","v":{"v":0,"d":"0.00"}},{"$f":"IF($P$5=\"nein\",'DRUCKEN - Alle Einsätze'!AD29+'DRUCKEN - Alle Einsätze'!AE29,0)","v":{"v":0,"d":"0.00"}},{"$f":"'Einsatz 1'!BQ30+'Einsatz 2'!BQ29+'Einsatz 3'!BQ29","v":{"v":0,"d":"0.00"}},{"$f":"'Einsatz 1'!BR30+'Einsatz 2'!BR29+'Einsatz 3'!BR29","v":{"v":0,"d":"0.00"}},null,null,{"$f":"'Einsatz 1'!BU30+'Einsatz 2'!BU29+'Einsatz 3'!BU29","v":{"v":0,"d":"0.00"}},{"$f":"'Einsatz 1'!BV30+'Einsatz 2'!BV29+'Einsatz 3'!BV29","v":{"v":0,"d":"0.00"}},{"$f":"'Einsatz 1'!BW30+'Einsatz 2'!BW29+'Einsatz 3'!BW29","v":{"v":0,"d":"0.00"}},{"$f":"'Einsatz 1'!BX30+'Einsatz 2'!BX29+'Einsatz 3'!BX29","v":{"v":0,"d":"0.00"}}]
["Sonntag","2023-01-22",{"$f":"'Einsatz 1'!C31","v":""},{"$f":"'Einsatz 1'!D31","v":0},{"$f":"'Einsatz 1'!E31","v":0},{"$f":"'Einsatz 1'!F31","v":0},{"$f":"'Einsatz 1'!G31","v":0},{"$f":"'Einsatz 1'!H31","v":"00:00:00"},{"$f":"IF($P$5=\"ja\",'DRUCKEN - Alle Einsätze'!AD30+'DRUCKEN - Alle Einsätze'!AE30,0)","v":{"v":0,"d":"0.00"}},{"$f":"IF($P$5=\"nein\",'DRUCKEN - Alle Einsätze'!AD30+'DRUCKEN - Alle Einsätze'!AE30,0)","v":{"v":0,"d":"0.00"}},{"$f":"'Einsatz 1'!BQ31+'Einsatz 2'!BQ30+'Einsatz 3'!BQ30","v":{"v":0,"d":"0.00"}},{"$f":"'Einsatz 1'!BR31+'Einsatz 2'!BR30+'Einsatz 3'!BR30","v":{"v":0,"d":"0.00"}},null,null,{"$f":"'Einsatz 1'!BU31+'Einsatz 2'!BU30+'Einsatz 3'!BU30","v":{"v":0,"d":"0.00"}},{"$f":"'Einsatz 1'!BV31+'Einsatz 2'!BV30+'Einsatz 3'!BV30","v":{"v":0,"d":"0.00"}},{"$f":"'Einsatz 1'!BW31+'Einsatz 2'!BW30+'Einsatz 3'!BW30","v":{"v":0,"d":"0.00"}},{"$f":"'Einsatz 1'!BX31+'Einsatz 2'!BX30+'Einsatz 3'!BX30","v":{"v":0,"d":"0.00"}}]
["Montag","2023-01-23",{"$f":"'Einsatz 1'!C32","v":""},{"$f":"'Einsatz 1'!D32","v":0},{"$f":"'Einsatz 1'!E32","v":0},{"$f":"'Einsatz 1'!F32","v":0},{"$f":"'Einsatz 1'!G32","v":0},{"$f":"'Einsatz 1'!H32","v":"00:00:00"},{"$f":"IF($P$5=\"ja\",'DRUCKEN - Alle Einsätze'!AD31+'DRUCKEN - Alle Einsätze'!AE31,0)","v":{"v":0,"d":"0.00"}},{"$f":"IF($P$5=\"nein\",'DRUCKEN - Alle Einsätze'!AD31+'DRUCKEN - Alle Einsätze'!AE31,0)","v":{"v":0,"d":"0.00"}},{"$f":"'Einsatz 1'!BQ32+'Einsatz 2'!BQ31+'Einsatz 3'!BQ31","v":{"v":0,"d":"0.00"}},{"$f":"'Einsatz 1'!BR32+'Einsatz 2'!BR31+'Einsatz 3'!BR31","v":{"v":0,"d":"0.00"}},null,null,{"$f":"'Einsatz 1'!BU32+'Einsatz 2'!BU31+'Einsatz 3'!BU31","v":{"v":0,"d":"0.00"}},{"$f":"'Einsatz 1'!BV32+'Einsatz 2'!BV31+'Einsatz 3'!BV31","v":{"v":0,"d":"0.00"}},{"$f":"'Einsatz 1'!BW32+'Einsatz 2'!BW31+'Einsatz 3'!BW31","v":{"v":0,"d":"0.00"}},{"$f":"'Einsatz 1'!BX32+'Einsatz 2'!BX31+'Einsatz 3'!BX31","v":{"v":0,"d":"0.00"}}]
["Dienstag","2023-01-24",{"$f":"'Einsatz 1'!C33","v":""},{"$f":"'Einsatz 1'!D33","v":0},{"$f":"'Einsatz 1'!E33","v":0},{"$f":"'Einsatz 1'!F33","v":0},{"$f":"'Einsatz 1'!G33","v":0},{"$f":"'Einsatz 1'!H33","v":"00:00:00"},{"$f":"IF($P$5=\"ja\",'DRUCKEN - Alle Einsätze'!AD32+'DRUCKEN - Alle Einsätze'!AE32,0)","v":{"v":0,"d":"0.00"}},{"$f":"IF($P$5=\"nein\",'DRUCKEN - Alle Einsätze'!AD32+'DRUCKEN - Alle Einsätze'!AE32,0)","v":{"v":0,"d":"0.00"}},{"$f":"'Einsatz 1'!BQ33+'Einsatz 2'!BQ32+'Einsatz 3'!BQ32","v":{"v":0,"d":"0.00"}},{"$f":"'Einsatz 1'!BR33+'Einsatz 2'!BR32+'Einsatz 3'!BR32","v":{"v":0,"d":"0.00"}},{"$f":"IF($O$3=12,'Einsatz 1'!BM33+'Einsatz 2'!BM32+'Einsatz 3'!BM32,'Einsatz 1'!BS33+'Einsatz 2'!BS32+'Einsatz 3'!BS32)","v":{"v":0,"d":"0.00"}},{"$f":"'Einsatz 1'!BN33+'Einsatz 2'!BN32+'Einsatz 3'!BN32","v":{"v":0,"d":"0.00"}},{"$f":"'Einsatz 1'!BU33+'Einsatz 2'!BU32+'Einsatz 3'!BU32","v":{"v":0,"d":"0.00"}},{"$f":"'Einsatz 1'!BV33+'Einsatz 2'!BV32+'Einsatz 3'!BV32","v":{"v":0,"d":"0.00"}},{"$f":"'Einsatz 1'!BW33+'Einsatz 2'!BW32+'Einsatz 3'!BW32","v":{"v":0,"d":"0.00"}},{"$f":"'Einsatz 1'!BX33+'Einsatz 2'!BX32+'Einsatz 3'!BX32","v":{"v":0,"d":"0.00"}}]
["Mittwoch","2023-01-25",{"$f":"'Einsatz 1'!C34","v":""},{"$f":"'Einsatz 1'!D34","v":0},{"$f":"'Einsatz 1'!E34","v":0},{"$f":"'Einsatz 1'!F34","v":0},{"$f":"'Einsatz 1'!G34","v":0},{"$f":"'Einsatz 1'!H34","v":"00:00:00"},{"$f":"IF($P$5=\"ja\",'DRUCKEN - Alle Einsätze'!AD33+'DRUCKEN - Alle Einsätze'!AE33,0)","v":{"v":0,"d":"0.00"}},{"$f":"IF($P$5=\"nein\",'DRUCKEN - Alle Einsätze'!AD33+'DRUCKEN - Alle Einsätze'!AE33,0)","v":{"v":0,"d":"0.00"}},{"$f":"'Einsatz 1'!BQ34+'Einsatz 2'!BQ33+'Einsatz 3'!BQ33","v":{"v":0,"d":"0.00"}},{"$f":"'Einsatz 1'!BR34+'Einsatz 2'!BR33+'Einsatz 3'!BR33","v":{"v":0,"d":"0.00"}},{"$f":"'Einsatz 1'!BS34+'Einsatz 2'!BS33+'Einsatz 3'!BS33","v":{"v":0,"d":"0.00"}},{"$f":"'Einsatz 1'!BT34+'Einsatz 2'!BT33+'Einsatz 3'!BT33","v":{"v":0,"d":"0.00"}},{"$f":"IF(N33>0,\"\",'Einsatz 1'!BU34+'Einsatz 2'!BU33+'Einsatz 3'!BU33)","v":{"v":0,"d":"0.00"}},{"$f":"IF($O$3=12,0,IF(N33<0,\"\",'Einsatz 1'!BV34+'Einsatz 2'!BV33+'Einsatz 3'!BV33))","v":{"v":0,"d":"0.00"}},{"$f":"IF($O$3=12,0,'Einsatz 1'!BW34+'Einsatz 2'!BW33+'Einsatz 3'!BW33)","v":{"v":0,"d":"0.00"}},{"$f":"'Einsatz 1'!BX34+'Einsatz 2'!BX33+'Einsatz 3'!BX33","v":{"v":0,"d":"0.00"}}]
["Donnerstag","2023-01-26",{"$f":"'Einsatz 1'!C35","v":""},{"$f":"'Einsatz 1'!D35","v":0},{"$f":"'Einsatz 1'!E35","v":0},{"$f":"'Einsatz 1'!F35","v":0},{"$f":"'Einsatz 1'!G35","v":0},{"$f":"'Einsatz 1'!H35","v":"00:00:00"},{"$f":"IF($P$5=\"ja\",'DRUCKEN - Alle Einsätze'!AD34+'DRUCKEN - Alle Einsätze'!AE34,0)","v":{"v":0,"d":"0.00"}},{"$f":"IF($P$5=\"nein\",'DRUCKEN - Alle Einsätze'!AD34+'DRUCKEN - Alle Einsätze'!AE34,0)","v":{"v":0,"d":"0.00"}},{"$f":"'Einsatz 1'!BQ35+'Einsatz 2'!BQ34+'Einsatz 3'!BQ34","v":{"v":0,"d":"0.00"}},{"$f":"'Einsatz 1'!BR35+'Einsatz 2'!BR34+'Einsatz 3'!BR34","v":{"v":0,"d":"0.00"}},{"$f":"'Einsatz 1'!BS35+'Einsatz 2'!BS34+'Einsatz 3'!BS34","v":{"v":0,"d":"0.00"}},{"$f":"'Einsatz 1'!BT35+'Einsatz 2'!BT34+'Einsatz 3'!BT34","v":{"v":0,"d":"0.00"}},{"$f":"IF(N34<0,\"\",'Einsatz 1'!BU35+'Einsatz 2'!BU34+'Einsatz 3'!BU34)","v":{"v":0,"d":"0.00"}},{"$f":"IF($O$3=12,0,IF(N34<0,\"\",'Einsatz 1'!BV35+'Einsatz 2'!BV34+'Einsatz 3'!BV34))","v":{"v":0,"d":"0.00"}},{"$f":"IF($O$3=12,0,'Einsatz 1'!BW35+'Einsatz 2'!BW34+'Einsatz 3'!BW34)","v":{"v":0,"d":"0.00"}},{"$f":"'Einsatz 1'!BX35+'Einsatz 2'!BX34+'Einsatz 3'!BX34","v":{"v":0,"d":"0.00"}}]
["Freitag","2023-01-27",{"$f":"'Einsatz 1'!C36","v":""},{"$f":"'Einsatz 1'!D36","v":0},{"$f":"'Einsatz 1'!E36","v":0},{"$f":"'Einsatz 1'!F36","v":0},{"$f":"'Einsatz 1'!G36","v":0},{"$f":"'Einsatz 1'!H36","v":"00:00:00"},{"$f":"IF($P$5=\"ja\",'DRUCKEN - Alle Einsätze'!AD35+'DRUCKEN - Alle Einsätze'!AE35,0)","v":{"v":0,"d":"0.00"}},{"$f":"IF($P$5=\"nein\",'DRUCKEN - Alle Einsätze'!AD35+'DRUCKEN - Alle Einsätze'!AE35,0)","v":{"v":0,"d":"0.00"}},{"$f":"'Einsatz 1'!BQ36+'Einsatz 2'!BQ35+'Einsatz 3'!BQ35","v":{"v":0,"d":"0.00"}},{"$f":"'Einsatz 1'!BR36+'Einsatz 2'!BR35+'Einsatz 3'!BR35","v":{"v":0,"d":"0.00"}},null,null,{"$f":"'Einsatz 1'!BU36+'Einsatz 2'!BU35+'Einsatz 3'!BU35","v":{"v":0,"d":"0.00"}},{"$f":"'Einsatz 1'!BV36+'Einsatz 2'!BV35+'Einsatz 3'!BV35","v":{"v":0,"d":"0.00"}},{"$f":"'Einsatz 1'!BW36+'Einsatz 2'!BW35+'Einsatz 3'!BW35","v":{"v":0,"d":"0.00"}},{"$f":"'Einsatz 1'!BX36+'Einsatz 2'!BX35+'Einsatz 3'!BX35","v":{"v":0,"d":"0.00"}}]
["Samstag","2023-01-28",{"$f":"'Einsatz 1'!C37","v":""},{"$f":"'Einsatz 1'!D37","v":0},{"$f":"'Einsatz 1'!E37","v":0},{"$f":"'Einsatz 1'!F37","v":0},{"$f":"'Einsatz 1'!G37","v":0},{"$f":"'Einsatz 1'!H37","v":"00:00:00"},{"$f":"IF($P$5=\"ja\",'DRUCKEN - Alle Einsätze'!AD36+'DRUCKEN - Alle Einsätze'!AE36,0)","v":{"v":0,"d":"0.00"}},{"$f":"IF($P$5=\"nein\",'DRUCKEN - Alle Einsätze'!AD36+'DRUCKEN - Alle Einsätze'!AE36,0)","v":{"v":0,"d":"0.00"}},{"$f":"'Einsatz 1'!BQ37+'Einsatz 2'!BQ36+'Einsatz 3'!BQ36","v":{"v":0,"d":"0.00"}},{"$f":"'Einsatz 1'!BR37+'Einsatz 2'!BR36+'Einsatz 3'!BR36","v":{"v":0,"d":"0.00"}},null,null,{"$f":"'Einsatz 1'!BU37+'Einsatz 2'!BU36+'Einsatz 3'!BU36","v":{"v":0,"d":"0.00"}},{"$f":"'Einsatz 1'!BV37+'Einsatz 2'!BV36+'Einsatz 3'!BV36","v":{"v":0,"d":"0.00"}},{"$f":"'Einsatz 1'!BW37+'Einsatz 2'!BW36+'Einsatz 3'!BW36","v":{"v":0,"d":"0.00"}},{"$f":"'Einsatz 1'!BX37+'Einsatz 2'!BX36+'Einsatz 3'!BX36","v":{"v":0,"d":"0.00"}}]
["Sonntag",{"$f":"IF(MONTH(B36+1)=O3,B36+1,\"\")","v":"2023-01-29"},{"$f":"'Einsatz 1'!C38","v":""},{"$f":"'Einsatz 1'!D38","v":0},{"$f":"'Einsatz 1'!E38","v":0},{"$f":"'Einsatz 1'!F38","v":0},{"$f":"'Einsatz 1'!G38","v":0},{"$f":"'Einsatz 1'!H38","v":"00:00:00"},{"$f":"IF($P$5=\"ja\",'DRUCKEN - Alle Einsätze'!AD37+'DRUCKEN - Alle Einsätze'!AE37,0)","v":{"v":0,"d":"0.00"}},{"$f":"IF($P$5=\"nein\",'DRUCKEN - Alle Einsätze'!AD37+'DRUCKEN - Alle Einsätze'!AE37,0)","v":{"v":0,"d":"0.00"}},{"$f":"'Einsatz 1'!BQ38+'Einsatz 2'!BQ37+'Einsatz 3'!BQ37","v":{"v":0,"d":"0.00"}},{"$f":"'Einsatz 1'!BR38+'Einsatz 2'!BR37+'Einsatz 3'!BR37","v":{"v":0,"d":"0.00"}},null,null,{"$f":"'Einsatz 1'!BU38+'Einsatz 2'!BU37+'Einsatz 3'!BU37","v":{"v":0,"d":"0.00"}},{"$f":"'Einsatz 1'!BV38+'Einsatz 2'!BV37+'Einsatz 3'!BV37","v":{"v":0,"d":"0.00"}},{"$f":"'Einsatz 1'!BW38+'Einsatz 2'!BW37+'Einsatz 3'!BW37","v":{"v":0,"d":"0.00"}},{"$f":"'Einsatz 1'!BX38+'Einsatz 2'!BX37+'Einsatz 3'!BX37","v":{"v":0,"d":"0.00"}}]
["Montag",{"$f":"IF(MONTH(B36+2)=O3,B36+2,\"\")","v":"2023-01-30"},{"$f":"'Einsatz 1'!C39","v":""},{"$f":"'Einsatz 1'!D39","v":0},{"$f":"'Einsatz 1'!E39","v":0},{"$f":"'Einsatz 1'!F39","v":0},{"$f":"'Einsatz 1'!G39","v":0},{"$f":"'Einsatz 1'!H39","v":"00:00:00"},{"$f":"IF($P$5=\"ja\",'DRUCKEN - Alle Einsätze'!AD38+'DRUCKEN - Alle Einsätze'!AE38,0)","v":{"v":0,"d":"0.00"}},{"$f":"IF($P$5=\"nein\",'DRUCKEN - Alle Einsätze'!AD38+'DRUCKEN - Alle Einsätze'!AE38,0)","v":{"v":0,"d":"0.00"}},{"$f":"'Einsatz 1'!BQ39+'Einsatz 2'!BQ38+'Einsatz 3'!BQ38","v":{"v":0,"d":"0.00"}},{"$f":"'Einsatz 1'!BR39+'Einsatz 2'!BR38+'Einsatz 3'!BR38","v":{"v":0,"d":"0.00"}},null,null,{"$f":"'Einsatz 1'!BU39+'Einsatz 2'!BU38+'Einsatz 3'!BU38","v":{"v":0,"d":"0.00"}},{"$f":"'Einsatz 1'!BV39+'Einsatz 2'!BV38+'Einsatz 3'!BV38","v":{"v":0,"d":"0.00"}},{"$f":"'Einsatz 1'!BW39+'Einsatz 2'!BW38+'Einsatz 3'!BW38","v":{"v":0,"d":"0.00"}},{"$f":"'Einsatz 1'!BX39+'Einsatz 2'!BX38+'Einsatz 3'!BX38","v":{"v":0,"d":"0.00"}}]
["Dienstag",{"$f":"IF(MONTH(B36+3)=O3,B36+3,\"\")","v":"2023-01-31"},{"$f":"'Einsatz 1'!C40","v":""},{"$f":"'Einsatz 1'!D40","v":0},{"$f":"'Einsatz 1'!E40","v":0},{"$f":"'Einsatz 1'!F40","v":0},{"$f":"'Einsatz 1'!G40","v":0},{"$f":"'Einsatz 1'!H40","v":"00:00:00"},{"$f":"IF($P$5=\"ja\",'DRUCKEN - Alle Einsätze'!AD39+'DRUCKEN - Alle Einsätze'!AE39,0)","v":{"v":0,"d":"0.00"}},{"$f":"IF($P$5=\"nein\",'DRUCKEN - Alle Einsätze'!AD39+'DRUCKEN - Alle Einsätze'!AE39,0)","v":{"v":0,"d":"0.00"}},{"$f":"'Einsatz 1'!BQ40+'Einsatz 2'!BQ39+'Einsatz 3'!BQ39","v":{"v":0,"d":"0.00"}},{"$f":"'Einsatz 1'!BR40+'Einsatz 2'!BR39+'Einsatz 3'!BR39","v":{"v":0,"d":"0.00"}},{"$f":"'Einsatz 1'!BS40+'Einsatz 2'!BS39+'Einsatz 3'!BS39","v":{"v":0,"d":"0.00"}},{"$f":"'Einsatz 1'!BT40+'Einsatz 2'!BT39+'Einsatz 3'!BT39","v":{"v":0,"d":"0.00"}},{"$f":"'Einsatz 1'!BU40+'Einsatz 2'!BU39+'Einsatz 3'!BU39","v":{"v":0,"d":"0.00"}},{"$f":"'Einsatz 1'!BV40+'Einsatz 2'!BV39+'Einsatz 3'!BV39","v":{"v":0,"d":"0.00"}},{"$f":"'Einsatz 1'!BW40+'Einsatz 2'!BW39+'Einsatz 3'!BW39","v":{"v":0,"d":"0.00"}},{"$f":"'Einsatz 1'!BX40+'Einsatz 2'!BX39+'Einsatz 3'!BX39","v":{"v":0,"d":"0.00"}}]
[{"$nulls":8},{"$f":"SUM(I9:I39)","v":{"v":0,"d":"0.00"}},{"$f":"SUM(J9:J39)","v":{"v":0,"d":"0.00"}},{"v":0,"d":"0.00"},{"v":0,"d":"0.00"},{"v":0,"d":"0.00"},{"v":0,"d":"0.00"},{"v":0,"d":"0.00"},{"v":0,"d":"0.00"},{"v":0,"d":"0.00"},{"v":0,"d":"0.00"}]
[{"$nulls":3},{"$f":"'Einsatz 1'!D42","v":""},{"$f":"'Einsatz 1'!E42","v":""},{"$f":"'Einsatz 1'!F42","v":""},{"$f":"'Einsatz 1'!G42","v":""},{"$f":"'Einsatz 1'!H42","v":""},{"$f":"IF(I40=0,\"\",IF(I40>0,SUM(I9:I39),\"\"))","v":""},{"$f":"IF(J40=0,\"\",IF(J40>0,SUM(J9:J39),\"\"))","v":""},{"$f":"IF(K40=0,\"\",IF(K40>0,SUM(K9:K39),\"\"))","v":""},{"$f":"IF(L40=0,\"\",IF(L40>0,SUM(L9:L39),\"\"))","v":""},{"$f":"IF(M40=0,\"\",IF(M40>0,SUM(M9:M39),\"\"))","v":""},{"$f":"IF(N40=0,\"\",IF(N40>0,SUM(N9:N39),\"\"))","v":""},"","","",""]
["* Es gelten nur die gesetzlichen Feiertage. Weihnachten und 1. Mai sind unter Lohnart 5071 gesondert berücksichtigt.",{"$nulls":7},"** Auszuwählen ist an jedem Urlaubs- und/oder Krankheitstag jeweils \"ja\". ",{"$nulls":4},"*** Auszuwählen ist \"ja\" nur an dem Tag, an dem die Rufbereitschaft begann."]
[{"$nulls":16},{"$f":"'Einsatz 1'!BV46","v":"Stand des Formulars: 01.02.2023"}]

{"sheet":"Listen","index":5,"n_rows":26,"n_cols":20,"rows_kept":26,"hidden":true}
[2021,2022,2023,2024,2025,2026,2027,2028,2029,2030,2031,2032,2033,2034,2035,2036,2037,2038,2039,2040]
[1,2,3,4,5,6,7,8,9,10,11,12]
[null,"17.04.","9.4.","31.3.","20.4.","5.4.","28.3.","16.4.","1.4.","21.4.","13.4.","28.3.","17.4.","9.4.","25.3.","13.4.","5.4.","25.4.","10.4.","1.4."]
[]
[]
[]
[null,"ja","nein",{"$nulls":3},"Neujahr",null,null,"Ostern",null,"Karfreitag","Ostersonntag","Ostermontag","Chr. Himmelfehrt","Pfingstsonntag","Pfingstmontag","Fronleichnam"]
[{"$nulls":6},"Karfreitag",null,2022,"2022-04-17","17.04.",{"$f":"M8-2","v":103},{"$f":"J8-DATE(I8,1,1)-1","v":105},{"$f":"M8+1","v":106},{"$f":"M8+39","v":144},{"$f":"M8+49","v":154},{"$f":"M8+50","v":155},{"$f":"M8+60","v":165}]
[{"$nulls":6},"Ostersonntag",null,2023,"2023-04-09","9.4.",{"$f":"M9-2","v":95},{"$f":"J9-DATE(I9,1,1)-1","v":97},{"$f":"M9+1","v":98},{"$f":"M9+39","v":136},{"$f":"M9+49","v":146},{"$f":"M9+50","v":147},{"$f":"M9+60","v":157}]
[{"$nulls":6},"Ostermontag",null,2024,"2024-03-31","31.3.",87,89,90,128,138,139,149]
[{"$nulls":6},"Chr. Himmelfahrt",null,2025,"2025-04-20","20.4.",106,108,109,147,157,158,168]
[{"$nulls":6},"Pfingstmontag",null,2026,"2026-04-05","5.4.",91,93,94,132,142,143,153]
[{"$nulls":6},"Fronleichnam",null,2027,"2027-03-28","28.3.",83,85,86,124,134,135,145]
[{"$nulls":6},"Tag der Arbeit",null,2028,"2028-04-16","16.4.",103,105,106,144,154,155,165]
[{"$nulls":6},"Tag d. dt. Einheit",null,2029,"2029-04-01","1.4.",87,89,90,128,138,139,149]
[{"$nulls":6},"Allerheiligen",null,2030,"2030-04-21","21.4.",107,109,110,148,158,159,169]
[{"$nulls":8},2031,"2031-04-13","13.4.",99,101,102,140,150,151,161]
[{"$nulls":8},2032,"2032-03-28","28.3.",84,86,87,125,135,136,146]
[{"$nulls":8},2033,"2033-04-17","17.4.",103,105,106,144,154,155,165]
[{"$nulls":8},2034,"2034-04-09","9.4.",95,97,98,136,146,147,157]
[{"$nulls":8},2035,"2035-03-25","25.3.",80,82,83,121,131,132,142]
[{"$nulls":8},2036,"2036-04-13","13.4.",100,102,103,141,151,152,162]
[{"$nulls":8},2037,"2037-04-05","5.4.",91,93,94,132,142,143,153]
[{"$nulls":8},2038,"2038-04-25","25.4.",111,113,114,152,162,163,173]
[{"$nulls":8},2039,"2039-04-10","10.4.",96,98,99,137,147,148,158]
[{"$nulls":8},2040,"2040-04-01","1.4.",88,90,91,129,139,140,150]