{"text_format":"3","workbook":"xlsx","n_sheets":6,"sheets":["Einsatz 1","Einsatz 2","Einsatz 3","DRUCKEN - Alle Einsätze","DRUCKEN - Übertrag Berechnung","Listen"],"not_rendered":{"defined_names":1,"comments":3},"read":"whole","date_system":"1900"}

{"sheet":"Einsatz 1","index":0,"n_rows":46,"n_cols":90,"rows_kept":46,"merged":[[4,3,4,6],[4,11,4,12]]}
["Nachweis über Überstunden, Überstundenvergütung und Zeitzuschläge ",{"$nulls":72},"Datum:",{"$f":"TODAY()","v":"2023-02-01"}]
[]
[null,null,"1. Einsatz",{"$nulls":5},"Rufbereitschaft und Zeitzuschläge",{"$nulls":62},"Monat:",1,"Jahr:",2023]
[null,null,{"$f":"VLOOKUP(BW3,Listen!I8:K26,2)","v":"2023-04-09"}]
[null,null,"Name, Vorname:",{"$nulls":7},"Orga-Einheit:","Dezernat 5.3",{"$nulls":60},"Freizeitausgleich wird gewährt:","ja"]
[null,null,"Übliche Wegezeit (h:mm):",null,null,"Industriestunden:",{"$f":"D6*24","v":{"v":0,"d":"0.00"}}]
[{"$nulls":3},"Ja","Ja","Ja","Ja","Ja"]
["Tag","Datum","gesetzl. Feiertag in NRW*","Urlaub**","Krankheit (AU)**","Rufbereitschaft Mo-Fr 15:15 bis 07:00 des Folgetags***","Rufbereitschaft Sa, So, Feiertag (07:00 bis 07:00 des Folgetags)***","Rufbereitschaft       weniger als 12 Std.              (hh:mm)","Uhrzeit Einsatz von (hh:mm)","Uhrzeit Einsatz bis (hh:mm)","Arbeitszeit des Einsatzes (ohne Wegezeit)","Der Einsatz erfolgte ohne Präsenz (z.B. telefonisch)****","Grund des Einsatzes","AZ (ggf. mit WZ)","AZ (ggf. ,mit WZ) gerundet","Beginn Nacht-arbeits-zeit-rahmen","Ende Nacht-arbeits-zeit-rahmen","Nacht-einsatz? \n1-Ja ","Wegezeit 1-ja","Beginn Nacht-einsatz (ohne WZ)","Ende Nacht-einsatz (ohne WZ)","Beginn Nacht-einsatz (mit WZ)","Ende Nachtarbeit (mit WZ)","Nachtarbeit mit WZ","Nachtarbeit ohne WZ","Ende Nacht-einsatz (mit WZ) vor 0","Ende Nacht-einsatz (mit WZ) nach 0","Ende Nacht-einsatz (o WZ) vor 0","Ende Nacht-einsatz (o WZ) nach 0","Summe Nacht-einsatz (mit WZ)","Summe Nacht-einsatz (o WZ)","Samstagsarbeit 13-21 Uhr (mit WZ)","Samstagsarbeit 13-21 Uhr (o WZ)","Samstagsarbeit, wenn negative Zeiten","Beginn Samstags-arbeit o WZ","Beginn Samstags-arbeit m WZ","Ende Samstags-arbeit o WZ","Ende Samstags-arbeit m WZ","Samstagsarbeit 20-21 m WZ","Samstagsarbeit 20-21 o WZ","Beginn Sonntagsarbeit mit WZ","Ende Sonntagsarbeit mit WZ","Beginn Sonntagsarbeit o WZ","Ende Sonntagsarbeit o WZ","Sonntagsarbeit mit WZ","Sonntagsarbeit o WZ","Sonntagsarbeit mit WZ (dezimal)","Sonntagsarbeit o WZ (dezimal)","Beginn Rahmen 24. & 31.12.","Ende Rahmen 24. & 31.12.","Arbeit 24. & 31.12.","Arbeit 24. & 31.12. Ende nach 0 Uhr","Arbeit am 24. & 31.12. (24 h)","Arbeit am 24. & 31.12. (14 h)","Beginn 24.12. & 31.12. (mit WZ)","Ende 24.12. & 31.12. (mit WZ)","Beginn 24.12. & 31.12. (o WZ)","Ende 24.12. & 31.12. (o WZ)","Arbeit 24.12. & 31.12. (mit WZ)","Arbeit 24.12. & 31.12. (o WZ)","Beginn 24.12. & 31.12. (mit WZ)","Ende 24.12. & 31.12. bis 14 Uhr (mit WZ)","Beginn 24.12. & 31.12. (o WZ)","Ende 24.12. & 31.12. bis 14 Uhr (o WZ)","Ende 24. & 31.12. vor 14 Uhr BB32, BC32 dezimal)","Ende 24. & 31.12. nach 14 Uhr","Stunden mit Freizeitausgleich","Stunden ohne Freizeitausgleich","Arbeit am Samstag           13-20 Uhr","Arbeit am Samstag          20-21 Uhr","Arbeit am 24.12.& 31.12. \n 6-14 Uhr","Arbeit am 24.12. 14-24 Uhr; am 25./26.12.           & am 01.05. ","Arbeit am Sonntag","Arbeit am Feiertag mit Freizeitausgleich","Arbeit am Feiertag ohne Freizeitausgleich","Nachtarbeit                 (21-6 Uhr)"]
{"$rows_left_out":39}
{"sheet":"Einsatz 2","index":1,"n_rows":45,"n_cols":76,"rows_kept":45,"merged":[[4,11,4,12]]}
["Nachweis über Überstunden, Überstundenvergütung und Zeitzuschläge ",{"$nulls":72},"Datum:",{"$f":"TODAY()","v":"2023-02-01"}]
[]
[null,null,"2. Einsatz",{"$nulls":5},"Rufbereitschaft und Zeitzuschläge",{"$nulls":62},"Monat:",{"$f":"'Einsatz 1'!BU3","v":1},"Jahr:",{"$f":"'Einsatz 1'!BW3","v":2023}]
[]
[null,null,"Name, Vorname:",{"$f":"'Einsatz 1'!D5","v":0},{"$nulls":6},"Orga-Einheit:",{"$f":"'Einsatz 1'!L5","v":"Dezernat 5.3"},{"$nulls":60},"Freizeitausgleich wird gewährt:",{"$f":"'Einsatz 1'!BV5","v":"ja"}]
[null,null,"Übliche Wegezeit (h:mm):",{"$f":"'Einsatz 1'!D6","v":"00:00:00"},null,"Industriestunden:",{"$f":"D6*24","v":{"v":0,"d":"0.00"}}]
["Tag","Datum","gesetzl. Feiertag in NRW*","Urlaub**","Krankheit (AU)**","Rufbereitschaft Mo-Fr 15:15 bis 07:00 des Folgetags***","Rufbereitschaft Sa, So, Feiertag (07:00 bis 07:00 des Folgetags)***","Rufbereitschaft       weniger als 12 Std.              (hh:mm)","Uhrzeit Einsatz von (hh:mm)","Uhrzeit Einsatz bis (hh:mm)","Arbeitszeit des Einsatzes (ohne Wegezeit)","Der Einsatz erfolgte ohne Präsenz (z.B. telefonisch)****","Grund des Einsatzes ","AZ (ggf. mit WZ)","AZ (ggf. ,mit WZ) gerundet","Beginn Nacht-arbeits-zeit-rahmen","Ende Nacht-arbeits-zeit-rahmen","Nacht-einsatz? \n1-Ja ","Wegezeit 1-ja","Beginn Nacht-einsatz (ohne WZ)","Ende Nacht-einsatz (ohne WZ)","Beginn Nacht-einsatz (mit WZ)","Ende Nachtarbeit (mit WZ)","Nachtarbeit mit WZ","Nachtarbeit ohne WZ","Ende Nacht-einsatz (mit WZ) vor 0","Ende Nacht-einsatz (mit WZ) nach 0","Ende Nacht-einsatz (o WZ) vor 0","Ende Nacht-einsatz (o WZ) nach 0","Summe Nacht-einsatz (mit WZ)","Summe Nacht-einsatz (o WZ)","Samstagsarbeit 13-21 Uhr (mit WZ)","Samstagsarbeit 13-21 Uhr (o WZ)","Samstagsarbeit, wenn negative Zeiten","Beginn Samstags-arbeit o WZ","Beginn Samstags-arbeit m WZ","Ende Samstags-arbeit o WZ","Ende Samstags-arbeit m WZ","Samstagsarbeit 20-21 m WZ","Samstagsarbeit 20-21 o WZ","Beginn Sonntagsarbeit mit WZ","Ende Sonntagsarbeit mit WZ","Beginn Sonntagsarbeit o WZ","Ende Sonntagsarbeit o WZ","Sonntagsarbeit mit WZ","Sonntagsarbeit o WZ","Sonntagsarbeit mit WZ (dezimal)","Sonntagsarbeit o WZ (dezimal)","Beginn Rahmen 24. & 31.12.","Ende Rahmen 24. & 31.12.","Arbeit 24. & 31.12.","Arbeit 24. & 31.12. Ende nach 0 Uhr","Arbeit am 24. & 31.12. (24 h)","Arbeit am 24. & 31.12. (14 h)","Beginn 24.12. & 31.12. (mit WZ)","Ende 24.12. & 31.12. (mit WZ)","Beginn 24.12. & 31.12. (o WZ)","Ende 24.12. & 31.12. (o WZ)","Arbeit 24.12. & 31.12. (mit WZ)","Arbeit 24.12. & 31.12. (o WZ)","Beginn 24.12. & 31.12. (mit WZ)","Ende 24.12. & 31.12. bis 14 Uhr (mit WZ)","Beginn 24.12. & 31.12. (o WZ)","Ende 24.12. & 31.12. bis 14 Uhr (o WZ)","Ende 24. & 31.12. vor 14 Uhr BB32, BC32 dezimal)","Ende 24. & 31.12. nach 14 Uhr","Stunden mit Freizeitausgleich","Stunden ohne Freizeitausgleich","Arbeit am Samstag           13-20 Uhr","Arbeit am Samstag          20-21 Uhr","Arbeit am 24.12.& 31.12. \n 6-14 Uhr","Arbeit am 24.12. 14-24 Uhr; am 25./26.12.           & am 01.05. ","Arbeit am Sonntag","Arbeit am Feiertag mit Freizeitausgleich","Arbeit am Feiertag ohne Freizeitausgleich","Nachtarbeit                 (21-6 Uhr)"]
[{"$nulls":3},5167,5168,5200,5201,5204,{"$nulls":58},5012,"5012 und 5014",5080,5083,5070,5071,5050,5061,"5060 und 5061",5040]
{"$rows_left_out":38}
{"sheet":"Einsatz 3","index":2,"n_rows":45,"n_cols":76,"rows_kept":45,"merged":[[4,11,4,12]]}
["Nachweis über Überstunden, Überstundenvergütung und Zeitzuschläge ",{"$nulls":72},"Datum:",{"$f":"TODAY()","v":"2023-02-01"}]
[]
[null,null,"3. Einsatz",{"$nulls":5},"Rufbereitschaft und Zeitzuschläge",{"$nulls":62},"Monat:",{"$f":"'Einsatz 1'!BU3","v":1},"Jahr:",{"$f":"'Einsatz 1'!BW3","v":2023}]
[]
[null,null,"Name, Vorname:",{"$f":"'Einsatz 1'!D5","v":0},{"$nulls":6},"Orga-Einheit:",{"$f":"'Einsatz 1'!L5","v":"Dezernat 5.3"},{"$nulls":60},"Freizeitausgleich wird gewährt:",{"$f":"'Einsatz 1'!BV5","v":"ja"}]
[null,null,"Übliche Wegezeit (h:mm):",{"$f":"'Einsatz 1'!D6","v":"00:00:00"},null,"Industriestunden:",{"$f":"D6*24","v":{"v":0,"d":"0.00"}}]
["Tag","Datum","gesetzl. Feiertag in NRW*","Urlaub**","Krankheit (AU)**","Rufbereitschaft Mo-Fr 15:15 bis 07:00 des Folgetags***","Rufbereitschaft Sa, So, Feiertag (07:00 bis 07:00 des Folgetags)***","Rufbereitschaft       weniger als 12 Std.              (hh:mm)","Uhrzeit Einsatz von (hh:mm)","Uhrzeit Einsatz bis (hh:mm)","Arbeitszeit des Einsatzes (ohne Wegezeit)","Der Einsatz erfolgte ohne Präsenz (z.B. telefonisch)****","Grund des Einsatzes","AZ (ggf. mit WZ)","AZ (ggf. ,mit WZ) gerundet","Beginn Nacht-arbeits-zeit-rahmen","Ende Nacht-arbeits-zeit-rahmen","Nacht-einsatz? \n1-Ja ","Wegezeit 1-ja","Beginn Nacht-einsatz (ohne WZ)","Ende Nacht-einsatz (ohne WZ)","Beginn Nacht-einsatz (mit WZ)","Ende Nachtarbeit (mit WZ)","Nachtarbeit mit WZ","Nachtarbeit ohne WZ","Ende Nacht-einsatz (mit WZ) vor 0","Ende Nacht-einsatz (mit WZ) nach 0","Ende Nacht-einsatz (o WZ) vor 0","Ende Nacht-einsatz (o WZ) nach 0","Summe Nacht-einsatz (mit WZ)","Summe Nacht-einsatz (o WZ)","Samstagsarbeit 13-21 Uhr (mit WZ)","Samstagsarbeit 13-21 Uhr (o WZ)","Samstagsarbeit, wenn negative Zeiten","Beginn Samstags-arbeit o WZ","Beginn Samstags-arbeit m WZ","Ende Samstags-arbeit o WZ","Ende Samstags-arbeit m WZ","Samstagsarbeit 20-21 m WZ","Samstagsarbeit 20-21 o WZ","Beginn Sonntagsarbeit mit WZ","Ende Sonntagsarbeit mit WZ","Beginn Sonntagsarbeit o WZ","Ende Sonntagsarbeit o WZ","Sonntagsarbeit mit WZ","Sonntagsarbeit o WZ","Sonntagsarbeit mit WZ (dezimal)","Sonntagsarbeit o WZ (dezimal)","Beginn Rahmen 24. & 31.12.","Ende Rahmen 24. & 31.12.","Arbeit 24. & 31.12.","Arbeit 24. & 31.12. Ende nach 0 Uhr","Arbeit am 24. & 31.12. (24 h)","Arbeit am 24. & 31.12. (14 h)","Beginn 24.12. & 31.12. (mit WZ)","Ende 24.12. & 31.12. (mit WZ)","Beginn 24.12. & 31.12. (o WZ)","Ende 24.12. & 31.12. (o WZ)","Arbeit 24.12. & 31.12. (mit WZ)","Arbeit 24.12. & 31.12. (o WZ)","Beginn 24.12. & 31.12. (mit WZ)","Ende 24.12. & 31.12. bis 14 Uhr (mit WZ)","Beginn 24.12. & 31.12. (o WZ)","Ende 24.12. & 31.12. bis 14 Uhr (o WZ)","Ende 24. & 31.12. vor 14 Uhr BB32, BC32 dezimal)","Ende 24. & 31.12. nach 14 Uhr","Stunden mit Freizeitausgleich","Stunden ohne Freizeitausgleich","Arbeit am Samstag           13-20 Uhr","Arbeit am Samstag          20-21 Uhr","Arbeit am 24.12.& 31.12. \n 6-14 Uhr","Arbeit am 24.12. 14-24 Uhr; am 25./26.12.           & am 01.05. ","Arbeit am Sonntag","Arbeit am Feiertag mit Freizeitausgleich","Arbeit am Feiertag ohne Freizeitausgleich","Nachtarbeit                 (21-6 Uhr)"]
[{"$nulls":3},5167,5168,5200,5201,5204,{"$nulls":58},5012,"5012 und 5014",5080,5083,5070,5071,5050,5061,"5060 und 5061",5040]
{"$rows_left_out":38}
{"sheet":"DRUCKEN - Alle Einsätze","index":3,"n_rows":85,"n_cols":31,"rows_kept":85,"merged":[[4,11,4,12],[53,3,53,9],[53,10,53,17],[53,18,53,25],[54,3,54,9],[54,10,54,17],[54,18,54,25],[55,3,55,9],[55,10,55,17],[55,18,55,25],[56,3,56,9],[56,10,56,17],[56,18,56,25],[57,3,57,9],[57,10,57,17],[57,18,57,25],[58,3,58,9],[58,10,58,17],[58,18,58,25],[59,3,59,9],[59,10,59,17],[59,18,59,25],[60,3,60,9],[60,10,60,17],[60,18,60,25],[61,3,61,9],[61,10,61,17],[61,18,61,25],[62,3,62,9],[62,10,62,17],[62,18,62,25],[63,3,63,9],[63,10,63,17],[63,18,63,25],[64,3,64,9],[64,10,64,17],[64,18,64,25],[65,3,65,9],[65,10,65,17],[65,18,65,25],[66,3,66,9],[66,10,66,17],[66,18,66,25],[67,3,67,9],[67,10,67,17],[67,18,67,25],[68,3,68,9],[68,10,68,17],[68,18,68,25],[69,3,69,9],[69,10,69,17],[69,18,69,25],[70,3,70,9],[70,10,70,17],[70,18,70,25],[71,3,71,9],[71,10,71,17],[71,18,71,25],[72,3,72,9],[72,10,72,17],[72,18,72,25],[73,3,73,9],[73,10,73,17],[73,18,73,25],[74,3,74,9],[74,10,74,17],[74,18,74,25],[75,3,75,9],[75,10,75,17],[75,18,75,25],[76,3,76,9],[76,10,76,17],[76,18,76,25],[77,3,77,9],[77,10,77,17],[77,18,77,25],[78,3,78,9],[78,10,78,17],[78,18,78,25],[79,3,79,9],[79,10,79,17],[79,18,79,25],[80,3,80,9],[80,10,80,17],[80,18,80,25],[81,3,81,9],[81,10,81,17],[81,18,81,25],[82,3,82,9],[82,10,82,17],[82,18,82,25],[83,3,83,9],[83,10,83,17],[83,18,83,25],[84,3,84,9],[84,10,84,17],[84,18,84,25],[85,3,85,9],[85,10,85,17],[85,18,85,25]]}
["Nachweis über Überstunden, Überstundenvergütung und Zeitzuschläge ",{"$nulls":24},"Datum:",{"$f":"TODAY()","v":"2023-02-01"}]
[]
[null,null,"Gesamtübersicht über Einsätze",{"$nulls":5},"Rufbereitschaft und Zeitzuschläge",{"$nulls":10},"Monat:",null,null,{"$f":"'Einsatz 1'!BU3","v":1},"Jahr:",{"$f":"'Einsatz 1'!BW3","v":2023}]
[]
[null,null,"Name, Vorname:",{"$f":"'Einsatz 1'!D5","v":0},{"$nulls":6},"Orga-Einheit:",{"$f":"'Einsatz 1'!L5","v":"Dezernat 5.3"},{"$nulls":10},"Freizeitausgleich wird gewährt:",{"$f":"'Einsatz 1'!BV5","v":"ja"}]
[null,null,"Übliche Wegezeit (h:mm):",{"$f":"'Einsatz 1'!D6","v":"00:00:00"},null,"Industriestunden:",{"$f":"D6*24","v":{"v":0,"d":"0.00"}},null,"1. Einsatz ",{"$nulls":6},"2. Einsatz ",{"$nulls":6},"3. Einsatz "]
["Tag","Datum","gesetzl. Feiertag in NRW*","Urlaub**","Krankheit (AU)**","Rufbereitschaft Mo-Fr 15:15 bis 07:00 des Folgetags***","Rufbereitschaft Sa, So, Feiertag (07:00 bis 07:00 des Folgetags)***","Rufbereitschaft       weniger als 12 Std.              (hh:mm)","Uhrzeit Einsatz von (hh:mm)","Uhrzeit Einsatz bis (hh:mm)","Arbeitszeit des Einsatzes (ohne Wegezeit)","Der Einsatz erfolgte ohne Präsenz (z.B. telefonisch)****","Grund des Einsatzes ","Einsatz mit WZ","Einsatz ohne WZ","Uhrzeit Einsatz von (hh:mm)","Uhrzeit Einsatz bis (hh:mm)","Arbeitszeit des Einsatzes (ohne Wegezeit)","Der Einsatz erfolgte ohne Präsenz (z.B. telefonisch)****","Grund des Einsatzes ","Einsatz mit WZ","Einsatz ohne WZ","Uhrzeit Einsatz von (hh:mm)","Uhrzeit Einsatz bis (hh:mm)","Arbeitszeit des Einsatzes (ohne Wegezeit)","Der Einsatz erfolgte ohne Präsenz (z.B. telefonisch)****","Grund des Einsatzes ","Einsatz mit WZ","Einsatz ohne WZ","Summe Einsätze mit WZ","Summe Einsätze ohne WZ"]
[{"$nulls":3},5167,5168,5200,5201,5204]
{"$rows_left_out":78}
{"sheet":"DRUCKEN - Übertrag Berechnung","index":4,"n_rows":43,"n_cols":18,"rows_kept":43,"merged":[[4,9,4,10]]}
["Nachweis über Überstunden, Überstundenvergütung und Zeitzuschläge ",{"$nulls":15},"Datum:",{"$f":"TODAY()","v":"2023-02-01"}]
[]
[null,null,"Übertrag und Berechnung",{"$nulls":4},"Rufbereitschaft und Zeitzuschläge",{"$nulls":5},"Monat:",{"$f":"'Einsatz 1'!BU3","v":1},"Jahr:",{"$f":"'Einsatz 1'!BW3","v":2023}]
[]
[null,null,"Name, Vorname:",{"$f":"'Einsatz 1'!D5","v":0},{"$nulls":4},"Orga-Einheit:",{"$f":"'Einsatz 1'!L5","v":"Dezernat 5.3"},{"$nulls":4},"Freizeitausgleich wird gewährt:",{"$f":"'Einsatz 1'!BV5","v":"ja"}]
[null,null,"Übliche Wegezeit (h:mm):",{"$f":"'Einsatz 1'!D6","v":"00:00:00"},null,"Industriestunden:",{"$f":"D6*24","v":{"v":0,"d":"0.00"}}]
["Tag","Datum","gesetzl. Feiertag in NRW*","Urlaub**","Krankheit (AU)**","Rufbereitschaft Mo-Fr 15:15 bis 07:00 des Folgetags***","Rufbereitschaft Sa, So, Feiertag (07:00 bis 07:00 des Folgetags)***","Rufbereitschaft       weniger als 12 Std.              (hh:mm)","Stunden mit Freizeitausgleich","Stunden ohne Freizeitausgleich","Arbeit am Samstag           13-20 Uhr","Arbeit am Samstag          20-21 Uhr","Arbeit am 24.12.& 31.12. \n 6-14 Uhr","Arbeit am 24.12. 14-24 Uhr; am 25./26.12.           & am 01.05. ","Arbeit am Sonntag","Arbeit am Feiertag mit Freizeitausgleich","Arbeit am Feiertag ohne Freizeitausgleich","Nachtarbeit                 (21-6 Uhr)"]
[{"$nulls":3},5167,5168,5200,5201,5204,5012,"5012 und 5014",5080,5083,5070,5071,5050,5061,"5060 und 5061",5040]
{"$rows_left_out":36}
{"sheet":"Listen","index":5,"n_rows":26,"n_cols":20,"rows_kept":26,"hidden":true}
[2021,2022,2023,2024,2025,2026,2027,2028,2029,2030,2031,2032,2033,2034,2035,2036,2037,2038,2039,2040]
[1,2,3,4,5,6,7,8,9,10,11,12]
[null,"17.04.","9.4.","31.3.","20.4.","5.4.","28.3.","16.4.","1.4.","21.4.","13.4.","28.3.","17.4.","9.4.","25.3.","13.4.","5.4.","25.4.","10.4.","1.4."]
[]
[]
[]
[null,"ja","nein",{"$nulls":3},"Neujahr",null,null,"Ostern",null,"Karfreitag","Ostersonntag","Ostermontag","Chr. Himmelfehrt","Pfingstsonntag","Pfingstmontag","Fronleichnam"]
[{"$nulls":6},"Karfreitag",null,2022,"2022-04-17","17.04.",{"$f":"M8-2","v":103},{"$f":"J8-DATE(I8,1,1)-1","v":105},{"$f":"M8+1","v":106},{"$f":"M8+39","v":144},{"$f":"M8+49","v":154},{"$f":"M8+50","v":155},{"$f":"M8+60","v":165}]
{"$rows_left_out":18}